program: Gaussian 09
title: 000229415
version: EM64L-G09RevD.01
frameworkgroup: C1[X(C17H20N2O3S)]
method: RPBEPBE
basis: SDD
operation: Freq
keyword: #p
keyword: freq=noraman
keyword: PBEPBE/SDD
title: #p freq=noraman PBEPBE/SDD
converged: YES YES NO NO
title: Mulliken charges:
elementType: S O O O N N C C C C C C C C C C C C C C C C C H H H H H H H H H H H H H H H H H H H H
charge: 0.863894 -0.542911 -0.537420 -0.289680 -0.415709 -0.495708 -0.327687 -0.100078 -0.386556 -0.352967 -0.041776 0.498056 -0.233210 -0.215966 -0.322866 -0.439029 -0.683383 0.295570 -0.250264 -0.253948 -0.206534 -0.206577 -0.219456 0.218138 0.197573 0.210680 0.262765 0.193423 0.187511 0.274724 0.278388 0.287171 0.318374 0.225448 0.214848 0.212024 0.216777 0.290966 0.280838 0.280767 0.239714 0.238654 0.235420
chargesum: 0.00000
title: Mulliken charges with hydrogens summed into heavy atoms:
elementType: S O O O N N C C C C C C C C C C C C C C C C C
charge: 0.863894 -0.542911 -0.537420 -0.289680 -0.128538 -0.204742 0.088024 -0.100078 0.086889 0.027967 -0.041776 0.498056 0.041515 0.062422 -0.004492 -0.213581 -0.039733 0.295570 0.030575 0.026819 0.033179 0.032077 0.015964
polarizability: 3.29114520e+02 -2.21507048e+01 1.88815466e+02 -1.73624869e+00 -1.79602998e+00 2.14827293e+02
1716.lowfreq: -8.4875 -0.0026 -0.0021 -0.0020 3.0731 3.9250 12.1065 18.5732 29.4839
frequency: 12.0563 17.3478 29.3817 34.9617 40.0168 49.8976 67.6968 75.6738 87.6409 110.8730 133.4762 141.7833 168.5243 179.7052 196.7815 219.1759 229.0744 243.4525 267.5729 282.0051 307.1342 315.0705 344.0891 368.4493 387.2212 399.3220 404.4401 413.6209 420.6280 463.2041 508.2186 517.1642 532.5354 595.7844 603.2057 615.8727 639.0315 659.5738 693.8143 699.2470 705.0032 726.9734 742.9663 763.4418 782.2522 815.5972 828.3333 829.4165 853.9262 856.4892 868.9097 918.3181 922.4017 935.4507 956.0185 974.4483 979.3536 982.8795 987.8238 993.4833 998.3433 1003.8887 1008.9601 1047.9373 1052.4102 1058.6428 1075.2028 1110.2363 1120.2430 1122.0986 1135.7061 1172.1585 1174.5997 1182.6674 1208.4458 1229.3190 1261.6310 1273.4481 1289.1969 1294.0519 1300.5714 1311.2670 1351.3836 1363.6100 1371.5711 1383.4952 1390.0373 1409.6277 1435.2544 1452.7532 1453.6839 1458.3326 1472.8752 1476.2961 1476.8099 1485.3943 1490.0511 1506.7463 1578.6275 1595.9601 1603.1166 1605.7079 1650.6914 2957.0857 2975.6422 2978.4307 2990.5778 3002.7284 3045.3332 3072.9174 3076.1594 3080.1056 3116.7929 3134.4844 3144.5821 3152.7896 3153.8998 3160.6817 3162.3040 3172.4865 3196.6219 3522.9202 3553.6831
redmass: 4.3758 4.5956 4.4892 4.1326 5.0807 5.0018 2.4450 2.7071 4.6504 3.7155 5.6200 4.3257 7.1319 5.0400 5.8592 1.8410 1.6680 8.7298 4.1580 2.6195 3.6768 4.8541 7.3950 1.9023 3.4702 6.4654 2.8286 3.0054 4.0025 5.3350 3.3957 3.3853 2.8113 1.2288 6.4714 6.7264 6.2829 6.9079 2.2528 3.2665 8.8946 3.4343 1.2679 1.5609 9.1699 3.5355 1.8720 1.4748 1.2476 2.0005 1.4621 3.7577 2.6254 1.3840 1.3690 1.7677 5.6808 1.3907 4.9376 1.3328 2.8916 1.3470 4.0414 2.1829 2.8855 2.3632 1.5357 2.9579 1.3498 2.2758 1.8519 1.0567 1.1267 1.1286 1.8305 1.3517 1.3805 1.8605 1.1164 1.4452 1.3159 1.2596 1.4906 1.7562 2.3053 8.1919 1.2112 5.1054 2.2558 2.0266 1.1245 1.0837 1.0750 1.0525 2.0827 1.0967 1.6939 2.4061 5.8443 6.5897 5.8203 6.8823 4.3767 1.0587 1.0398 1.0572 1.0673 1.0986 1.1009 1.1005 1.0996 1.0982 1.0900 1.0855 1.0882 1.0917 1.0917 1.0948 1.0966 1.1016 1.0948 1.0762 1.0773
irintensity: 0.2789 1.5996 3.0219 1.5238 3.0469 0.7767 1.8411 6.0022 2.2081 1.7329 2.5857 0.8224 0.1473 1.0798 6.2672 0.8209 4.1066 7.2119 0.8943 6.1609 14.9582 9.7493 21.9535 31.6507 14.1841 0.5545 0.0204 0.1308 4.0424 33.2383 71.2820 64.2599 137.6430 131.4716 0.0149 1.0329 18.1650 25.4310 39.8700 10.2603 10.6390 3.2481 11.5266 82.5746 70.5381 5.3522 8.3538 21.2869 1.3823 7.2354 41.8729 34.1445 41.4132 1.9246 1.4606 12.2208 2.1174 0.0490 2.0449 2.8722 4.4961 0.3603 2.2856 39.2776 3.9285 45.2018 4.2773 4.8554 14.3367 0.6411 1.5719 0.0712 25.7524 38.9450 327.0006 42.1539 127.2131 4.4394 4.9776 42.5690 6.2407 44.7503 11.3231 70.6489 128.1243 3.2753 8.7816 11.7000 18.0392 21.0302 41.1835 5.7786 25.2279 4.2668 102.7756 23.5186 225.0835 750.1788 5.0838 67.9883 75.6966 2.5775 182.0320 31.2802 20.6092 58.7635 52.2266 6.8340 56.0775 77.9990 45.8299 10.1017 19.5261 0.8635 10.2941 0.8163 2.6834 7.0510 5.9939 31.8371 10.9466 5.2792 27.2811
temp: 298.150 k
press: 1.00000 atm
elementType: 16 8 8 8 7 7 6 6 6 6 6 6 6 6 6 6 6 6 6 6 6 6 6 1 1 1 1 1 1 1 1 1 1 1 1 1 1 1 1 1 1 1 1
symmnumber: 1
zpe: 891167.0 jmol-1
zpe.correction: 0.339428 hartree
zpe.thermalcorrener: 0.362890 hartree
zpe.thermalcorrenthalpy: 0.363834 hartree
zpe.thermalcorrgfe: 0.282197 hartree
zpe.sumelectzpe: -1391.213176 hartree
zpe.sumelectthermal: -1391.189714 hartree
zpe.sumelectthermalent: -1391.188770 hartree
zpe.sumelectthermalfe: -1391.270407 hartree
dipole: 6.8472 5.6925 4.0332
dipole: 9.7752
quadrupole: -130.7441 -149.5345 -137.1563
quadrupole: -31.2349 12.3236 -4.5201
quadrupole: 8.4009 -10.3895 1.9887 -31.2349 12.3236 -4.5201
hfenergy: -1391.552604 hartree
pointgroup: C01 [X(C17H20N2O3S1)]
dipole: -2.5701786 2.3453308 -1.6383707 debye
polarizability: 330.9536647|15.1978358|187.0552216|-1.0234412|2.3771559|214.7483929 unknown
InChI: InChI=1S/C17H20N2O3S/c1-2-3-13-18-17(20)19-14-9-11-16(12-10-14)23(21,22)15-7-5-4-6-8-15/h4-12,18-19H,2-3,13H2,1H3
charge 0 multiplicity 1
43 atoms
S  3.532782 -1.420319 0.045566
O  4.063409 -2.115407 -1.342545
O  3.774127 -2.068159 1.531596
O  -3.311915 -0.646689 1.540086
N  -4.781662 -0.560766 -0.27474
N  -2.48275 -0.789601 -0.672743
C  -6.523497 1.038058 0.625059
C  1.67361 -1.180575 -0.151426
C  -5.980192 -0.408568 0.569925
C  -7.037434 1.572329 -0.731505
C  4.285708 0.325419 0.091205
C  -1.09315 -0.920497 -0.442898
C  0.876698 -1.094624 1.000963
C  1.138632 -1.171217 -1.450024
C  -0.518871 -0.95871 0.86056
C  -0.253917 -1.034709 -1.590054
C  -7.619056 2.99885 -0.625043
C  -3.512477 -0.661569 0.289279
C  4.437441 0.945642 1.341145
C  4.717641 0.886561 -1.120456
C  5.031068 2.229521 1.367828
C  5.309546 2.170625 -1.074048
C  5.458196 2.839729 0.164318
H  -5.730112 1.703946 1.016844
H  -7.352438 1.06233 1.36173
H  -6.765452 -1.094663 0.195599
H  -5.689661 -0.739411 1.581503
H  -7.813739 0.884017 -1.126062
H  -6.208799 1.574987 -1.469899
H  1.336158 -1.162709 1.992777
H  1.793015 -1.298232 -2.318435
H  -4.901772 -0.538803 -1.287972
H  -1.171856 -0.891147 1.731923
H  -0.695659 -1.026638 -2.594569
H  -6.856221 3.709709 -0.256196
H  -8.47067 3.026477 0.080289
H  -7.978608 3.364821 -1.604038
H  -2.761656 -0.808334 -1.656132
H  4.12957 0.428733 2.256196
H  4.620835 0.323537 -2.054793
H  5.166506 2.744726 2.324587
H  5.660715 2.640362 -1.998865
H  5.920209 3.832671 0.193264
