program: Gaussian 09
title: 000229413
version: EM64L-G09RevD.01
frameworkgroup: C1[X(C11H15ClN2O3S)]
method: RPBEPBE
basis: SDD
operation: Freq
keyword: #p
keyword: freq=noraman
keyword: PBEPBE/SDD
title: #p freq=noraman PBEPBE/SDD
converged: YES YES NO NO
title: Mulliken charges:
elementType: Cl S O O O N N C C C C C C C C C C C H H H H H H H H H H H H H H H
charge: -0.057584 1.036481 -0.505394 -0.546307 -0.300882 -0.690781 -0.472514 -0.570107 -0.306104 -0.345309 -0.683837 0.383286 0.489056 -0.430396 -0.322163 -0.183285 -0.194763 -0.120478 0.269030 0.329505 0.222649 0.238861 0.203035 0.210867 0.335639 0.219217 0.223867 0.215690 0.302824 0.225721 0.311695 0.256711 0.255769
chargesum: 0.00000
title: Mulliken charges with hydrogens summed into heavy atoms:
elementType: Cl S O O O N N C C C C C C C C C C C
charge: -0.057584 1.036481 -0.505394 -0.546307 -0.300882 -0.355141 -0.169690 0.028428 0.155405 0.068593 -0.025063 0.383286 0.489056 -0.204675 -0.010467 0.073426 0.061006 -0.120478
polarizability: 3.05519929e+02 9.79014577e+00 1.78366767e+02 -1.69369492e+00 1.21355986e+01 1.08415593e+02
1716.lowfreq: -3.6487 -0.0017 -0.0015 0.0015 4.6820 6.6892 19.6741 25.5301 31.4593
frequency: 19.6582 25.4199 31.2470 53.0275 65.5954 69.2758 87.2076 98.2146 115.3574 141.7558 147.5370 166.1357 205.5429 214.6714 219.8090 235.9010 266.1078 296.7793 320.9855 329.7023 361.1338 383.4805 386.6725 408.3965 412.0192 448.8837 504.0535 565.5236 586.1488 597.6696 623.2317 691.1849 701.4772 705.5316 742.0144 748.1607 793.4916 811.8428 827.9677 843.7033 845.2251 893.1891 905.4734 936.3067 958.9983 979.6233 991.1397 997.8111 1024.7680 1061.7614 1075.0819 1086.7538 1101.1361 1116.5467 1145.1733 1185.4054 1200.9327 1236.7429 1258.3054 1273.2178 1290.7208 1294.4886 1306.0478 1315.9759 1343.5363 1370.6968 1393.4490 1401.6822 1425.5619 1473.3460 1476.4455 1477.6834 1478.8667 1489.6143 1501.0629 1594.2314 1607.0172 1615.5067 2979.4289 2981.3619 3000.0239 3026.9102 3034.8101 3064.2902 3081.4648 3082.4577 3120.6573 3132.9607 3166.4213 3173.3186 3197.8090 3492.0531 3534.4589
redmass: 4.1079 5.4295 5.0843 2.7434 2.3757 8.9992 5.8456 6.6598 2.4862 6.3740 5.5257 8.0869 7.6223 3.6782 2.1731 1.7220 6.2298 9.8344 3.7923 6.7919 5.6028 6.6381 1.8510 2.5309 2.8816 6.1359 2.6133 4.7292 2.9900 1.8640 6.9911 9.1022 4.0593 5.3221 6.9319 1.0756 1.1924 1.3986 10.8445 4.5552 1.5124 1.8898 1.5590 1.3577 2.7844 1.3221 5.3452 4.8129 3.6153 2.6792 2.5780 1.3159 2.2862 1.3293 1.7773 1.1123 1.5149 1.2109 2.2701 1.2149 1.3582 1.0750 1.2968 1.8441 1.4300 5.2326 1.2043 4.3119 1.1043 1.0663 1.0423 1.0645 2.3826 1.0891 2.2312 7.2080 5.8682 4.7231 1.0541 1.0407 1.0596 1.1012 1.0561 1.1041 1.1013 1.1001 1.0904 1.1112 1.0912 1.0952 1.0953 1.0791 1.0765
irintensity: 0.6575 0.6610 1.8082 0.1525 0.7305 1.0059 2.7469 10.2683 1.1179 6.2353 8.2473 0.4807 1.8299 7.6451 3.7049 0.4295 2.0351 10.1333 7.7275 30.1591 7.4238 14.8649 33.9474 39.6188 2.4801 26.0069 68.1956 132.9319 58.5711 142.2640 7.0315 60.6129 8.0267 3.0720 23.7358 8.5107 1.0023 39.7143 115.3136 10.0728 70.9361 7.1686 13.4202 0.9073 66.1716 3.5424 71.1343 5.0359 13.3949 10.6701 69.2579 32.5751 48.3915 18.7194 149.1998 3.2960 2.1807 8.3440 34.9425 2.8472 19.2829 0.5367 13.7225 257.6229 7.6737 336.5331 7.7984 36.7926 9.3758 5.2607 14.1226 0.4055 84.0721 18.7238 644.5271 41.0591 13.3315 103.7754 29.9006 26.5302 23.3209 6.7253 5.1337 3.6501 60.2410 44.7277 14.4806 9.7325 2.1664 2.6924 8.2308 28.1246 23.4491
temp: 298.150 k
press: 1.00000 atm
elementType: 17 16 8 8 8 7 7 6 6 6 6 6 6 6 6 6 6 6 1 1 1 1 1 1 1 1 1 1 1 1 1 1 1
symmnumber: 1
zpe: 654659.2 jmol-1
zpe.correction: 0.249347 hartree
zpe.thermalcorrener: 0.269514 hartree
zpe.thermalcorrenthalpy: 0.270458 hartree
zpe.thermalcorrgfe: 0.197289 hartree
zpe.sumelectzpe: -1619.951887 hartree
zpe.sumelectthermal: -1619.931720 hartree
zpe.sumelectthermalent: -1619.930776 hartree
zpe.sumelectthermalfe: -1620.003945 hartree
dipole: -0.4697 0.1346 -3.2126
dipole: 3.2496
quadrupole: -130.2650 -114.7879 -129.4073
quadrupole: -27.7190 5.1557 4.3748
quadrupole: -5.4450 10.0321 -4.5872 -27.7190 5.1557 4.3748
hfenergy: -1620.2012336 hartree
pointgroup: C01 [X(C11H15Cl1N2O3S1)]
dipole: -0.1617737 -0.1800603 1.2553565 debye
polarizability: 304.4460761|-14.7428219|176.0167127|-3.2720395|19.615858|111.8395004 unknown
InChI: InChI=1S/C11H15ClN2O3S/c1-2-3-8-18(16,17)14-11(15)13-10-6-4-9(12)5-7-10/h4-7,13-14H,2-3,8H2,1H3
charge 0 multiplicity 1
33 atoms
Cl 6.628393 -1.572367 -0.310589
S  -2.799903 1.426517 0.064504
O  -2.850631 1.495085 -1.550482
O  -3.506376 2.592414 0.947431
O  -0.31125 -0.498933 -0.215446
N  -1.029078 1.531939 0.687189
N  1.263711 1.167723 0.361291
C  -3.314149 -0.345873 0.671205
C  -4.664469 -0.723814 0.068788
C  -5.053483 -2.161611 0.510129
C  -6.415256 -2.58648 -0.080742
C  -0.031097 0.654217 0.231487
C  2.495202 0.472246 0.185874
C  3.689794 1.183081 0.481749
C  2.572197 -0.87104 -0.269332
C  4.94856 0.568368 0.329974
C  3.833175 -1.487538 -0.415565
C  5.003683 -0.766257 -0.115861
H  -3.31353 -0.220376 1.766269
H  -2.461227 -0.953384 0.325263
H  -5.449612 -0.014899 0.394275
H  -4.609039 -0.679733 -1.035039
H  -5.095373 -2.212779 1.616257
H  -4.267281 -2.87183 0.186715
H  -0.848438 2.45297 1.104961
H  -6.391735 -2.569074 -1.18586
H  -6.681889 -3.610556 0.236618
H  -7.222391 -1.907609 0.251082
H  1.352184 2.151418 0.624174
H  3.643363 2.221138 0.834325
H  1.655783 -1.412071 -0.50975
H  5.865795 1.118451 0.557486
H  3.896866 -2.521443 -0.766775
