program: Gaussian 09
title: 000021676
version: EM64L-G09RevD.01
frameworkgroup: C1[X(C10H15N2)]
method: RPBEPBE
basis: SDD
operation: Freq
keyword: #p
keyword: freq=noraman
keyword: PBEPBE/SDD
title: #p freq=noraman PBEPBE/SDD
converged: YES YES NO NO
title: Mulliken charges:
elementType: N N C C C C C C C C C C H H H H H H H H H H H H H H H
charge: -0.082490 -0.622242 -0.689914 0.463726 0.487015 -0.424465 -0.374261 -0.654896 -0.635301 -0.209020 -0.208015 -0.228795 0.262695 0.276542 0.248445 0.225980 0.280812 0.270700 0.263076 0.274131 0.271760 0.291263 0.375940 0.378948 0.253187 0.248857 0.256320
chargesum: 1.00000
title: Mulliken charges with hydrogens summed into heavy atoms:
elementType: N N C C C C C C C C C C
charge: -0.082490 0.132647 -0.150677 0.463726 0.487015 -0.176020 -0.148281 0.159692 0.201854 0.044167 0.040842 0.027525
polarizability: 1.40113604e+02 -1.10242953e+01 1.06393672e+02 6.06485501e+00 8.54231936e+00 9.70189403e+01
1716.lowfreq: -14.5890 -6.2618 -0.0004 0.0001 0.0003 13.8226 34.7624 53.4195 75.7167
frequency: 34.7279 53.3920 75.6054 113.2529 127.1705 171.5417 209.1094 279.0188 308.8590 311.9502 397.8997 401.9852 438.6949 464.5939 493.5688 551.9336 583.2336 615.2728 662.1948 687.3995 700.9981 727.1094 765.5152 818.0289 853.7525 911.4518 931.6476 953.5477 983.6837 990.3619 1011.8674 1026.8970 1046.9115 1073.6993 1086.2091 1089.8303 1139.2145 1170.0770 1182.9261 1194.4363 1196.3387 1209.0858 1267.1936 1291.1289 1338.4460 1383.2444 1431.0927 1436.4567 1444.2133 1448.6904 1464.2588 1470.7170 1480.1411 1484.0570 1487.3338 1499.3894 1594.8618 1608.4607 1641.2419 1672.7023 2986.6294 2999.4443 3009.9766 3058.2217 3073.8388 3099.1485 3114.9667 3122.2802 3139.4935 3149.3731 3156.3950 3160.2188 3177.7646 3527.5587 3656.4360
redmass: 3.2665 2.8582 3.2929 1.6881 1.1907 1.6585 3.7749 3.3334 3.2960 2.4390 2.3581 2.7924 2.5128 3.0342 1.8211 3.5028 1.4886 6.2418 1.6352 2.7320 2.6203 1.7444 2.3157 3.9361 1.2492 1.4577 2.4755 1.7537 1.3884 6.0967 1.3362 2.2734 1.6978 1.4212 1.2364 1.5912 1.3956 1.2774 1.0651 1.4166 1.8117 2.2297 2.3004 1.3725 1.2852 7.6235 1.5445 1.2843 2.0821 1.3843 1.2077 1.0758 1.3819 1.5260 1.0875 1.1056 6.0324 5.8689 1.8201 2.0190 1.0373 1.0627 1.0367 1.0988 1.1034 1.1029 1.0895 1.0901 1.0983 1.0894 1.0995 1.0950 1.1013 1.0479 1.1034
irintensity: 0.4613 0.0236 1.6166 2.8872 0.8914 0.6176 6.7780 7.1183 4.0862 1.5234 0.1075 0.0984 5.8789 2.5501 6.8833 0.4354 2.0502 0.8862 158.5905 109.5226 17.6270 60.0219 39.3172 3.5046 0.2480 2.3203 7.2443 2.2640 0.0354 5.7166 0.0340 3.7302 19.0942 9.7767 0.6459 6.9216 0.8564 24.0749 0.6201 0.5298 1.0630 2.1748 14.9352 3.9455 1.2516 0.8830 36.7676 3.1848 8.1144 17.6594 25.4646 24.5231 13.7133 4.0577 25.2049 22.0556 5.1807 3.2178 73.8347 358.9854 8.6261 15.3035 12.1435 3.6217 8.1653 4.0711 10.7994 7.2500 0.9960 1.2442 1.5012 12.9028 7.2211 123.5899 64.5365
temp: 298.150 k
press: 1.00000 atm
elementType: 7 7 6 6 6 6 6 6 6 6 6 6 1 1 1 1 1 1 1 1 1 1 1 1 1 1 1
symmnumber: 1
zpe: 615600.5 jmol-1
zpe.correction: 0.234470 hartree
zpe.thermalcorrener: 0.246778 hartree
zpe.thermalcorrenthalpy: 0.247722 hartree
zpe.thermalcorrgfe: 0.195333 hartree
zpe.sumelectzpe: -498.444858 hartree
zpe.sumelectthermal: -498.432550 hartree
zpe.sumelectthermalent: -498.431606 hartree
zpe.sumelectthermalfe: -498.483996 hartree
dipole: 7.1643 -0.8423 0.1033
dipole: 7.2144
quadrupole: -33.8074 -54.6715 -62.4611
quadrupole: -6.2126 -1.2004 -0.1714
quadrupole: 16.5059 -4.3582 -12.1477 -6.2126 -1.2004 -0.1714
hfenergy: -498.6793283 hartree
pointgroup: C01 [X(C10H15N2)]
dipole: -2.7842294 0.4926353 0.248438 debye
polarizability: 137.9631637|-10.9289831|111.5668776|-11.0789227|-3.6078894|93.9961744 unknown
InChI: InChI=1S/C10H15N2/c1-12(2)10(11)8-9-6-4-3-5-7-9/h3-7H,8,11H2,1-2H3
charge 1 multiplicity 1
27 atoms
N  -2.302596 -0.348385 -0.310859
N  -2.275812 1.58782 1.007582
C  -0.493026 -0.053536 1.412607
C  -1.736873 0.389485 0.660984
C  0.788464 -0.039496 0.565075
C  1.710394 -1.109534 0.677331
C  1.087727 1.051381 -0.289262
C  -3.531682 0.123211 -1.002199
C  -1.760072 -1.656688 -0.76093
C  2.919644 -1.0871 -0.053746
C  2.293935 1.069277 -1.024048
C  3.212504 0.000328 -0.908022
H  -0.370307 0.613536 2.287076
H  -0.660927 -1.064695 1.825371
H  1.497841 -1.953263 1.346017
H  0.393946 1.897348 -0.378537
H  -3.873322 -0.658905 -1.693807
H  -3.329954 1.037088 -1.591518
H  -4.34635 0.311233 -0.27875
H  -1.660689 -1.644152 -1.859187
H  -2.450716 -2.46712 -0.469634
H  -0.765819 -1.842586 -0.336291
H  -1.849792 2.1297 1.75889
H  -3.099067 1.987279 0.555779
H  3.630226 -1.913921 0.045684
H  2.520937 1.917144 -1.678607
H  4.149386 0.017253 -1.4738
