program: Gaussian 09
title: 000229406
version: EM64L-G09RevD.01
frameworkgroup: C1[X(C8H16O2)]
method: RPBEPBE
basis: SDD
operation: Freq
keyword: #pfreq=noraman
keyword: PBEPBE/SDD
title: #p freq=noraman PBEPBE/SDD
converged: YES YES NO NO
title: Mulliken charges:
elementType: O O C C C C C C C C H H H H H H H H H H H H H H H H
charge: -0.464483 -0.230929 -0.040623 -0.153187 -0.177517 0.171274 -0.704133 -0.720211 -0.695715 -0.694841 0.196545 0.224255 0.215045 0.251130 0.203860 0.211935 0.222721 0.212397 0.240002 0.241450 0.220984 0.222640 0.220687 0.241849 0.220869 0.363994
chargesum: 0.00000
title: Mulliken charges with hydrogens summed into heavy atoms:
elementType: O O C C C C C C C C
charge: -0.100488 -0.230929 0.155923 0.071068 0.037528 0.171274 -0.037208 -0.045091 -0.010641 -0.011436
polarizability: 1.06335859e+02 -8.34452067e-02 8.52343298e+01 1.66019551e+00 2.50818237e+00 8.61545887e+01
1716.lowfreq: -20.1560 -3.0353 -0.0010 -0.0010 -0.0010 7.3089 16.7722 58.9735 79.9723
frequency: -11.2580 58.8458 79.9260 139.5476 188.5142 197.8563 208.5303 227.1365 235.2939 245.3031 266.3442 284.5774 332.6576 343.1026 395.7631 433.8801 469.2305 588.7750 624.7737 690.1271 819.8128 834.9768 880.2541 914.8299 923.9508 940.7600 961.6410 964.3018 981.8505 1057.6368 1080.8039 1091.8335 1116.3359 1134.3433 1174.3576 1182.5725 1221.3876 1254.5905 1296.6547 1315.8627 1327.0096 1333.4201 1371.5960 1373.3773 1373.9591 1392.8990 1393.6081 1461.4286 1462.5250 1470.5956 1475.4773 1477.3975 1479.1221 1490.3989 1493.5948 1603.5049 2953.8266 2969.1250 2977.4587 2983.2568 2984.0124 2985.1517 3003.9382 3068.8265 3073.8753 3079.4605 3083.0791 3087.0937 3091.4835 3092.3988 3098.1627 3408.1143
redmass: 2.9983 3.0656 3.5552 3.7012 2.1017 1.0672 1.1534 1.7916 1.2556 1.9863 2.1744 2.2426 2.7185 5.6600 2.4653 2.6853 1.1470 2.9920 3.4146 3.0710 3.4527 3.3933 2.8243 1.2014 1.1655 2.3405 1.4398 1.4803 2.7053 2.0617 2.3688 1.5237 2.4316 1.8372 1.8489 2.0140 1.3994 1.3484 1.3225 1.3447 1.5133 1.5483 1.1999 1.2431 1.2786 1.2176 1.2147 1.0439 1.0462 1.0472 1.0498 1.0522 1.0470 1.0605 1.0542 7.5792 1.0825 1.0756 1.0379 1.0406 1.0347 1.0354 1.0835 1.0998 1.0987 1.1005 1.0996 1.1000 1.1013 1.0994 1.1003 1.0642
irintensity: 0.1483 0.2315 0.3307 0.2729 0.3324 0.0141 0.2284 0.9287 1.7687 4.9481 4.2995 1.8952 1.0722 23.6181 0.1615 2.2883 115.4023 0.3682 6.0516 3.0834 0.2677 1.0297 7.1811 5.6674 4.2844 19.5297 0.6407 0.1507 93.1966 70.8673 21.8139 30.5005 0.4726 5.9278 0.1675 21.9970 39.8779 14.1381 1.6738 3.1582 5.1402 43.0559 10.2482 39.1047 33.5250 30.4749 16.8551 5.6681 7.4611 1.8982 15.1083 8.9553 10.9901 21.5988 8.5236 67.4078 20.8122 48.4547 42.5116 7.8977 38.3728 18.7767 21.2153 20.8012 69.3611 16.5472 43.9931 1.1507 1.2652 37.6916 43.6571 39.6658
temp: 298.150 k
press: 1.00000 atm
elementType: 8 8 6 6 6 6 6 6 6 6 1 1 1 1 1 1 1 1 1 1 1 1 1 1 1 1
symmnumber: 1
zpe: 592618.7 jmol-1
zpe.correction: 0.225717 hartree
zpe.thermalcorrener: 0.237726 hartree
zpe.thermalcorrenthalpy: 0.238671 hartree
zpe.thermalcorrgfe: 0.188637 hartree
zpe.sumelectzpe: -464.061289 hartree
zpe.sumelectthermal: -464.049280 hartree
zpe.sumelectthermalent: -464.048335 hartree
zpe.sumelectthermalfe: -464.098369 hartree
dipole: -1.2648 2.6360 1.7768
dipole: 3.4213
quadrupole: -63.5467 -66.1236 -63.3727
quadrupole: 1.7058 -3.1430 -0.8053
quadrupole: 0.8010 -1.7759 0.9750 1.7058 -3.1430 -0.8053
hfenergy: -464.2870059 hartree
pointgroup: C01[X(C8H16O2)]
dipole: 0.5340243 1.1247443 0.5114471 debye
dipolederiv: -0.4995526 -0.22255 -0.0051178 -0.1442058 -0.5278633 -0.1602248 -0.0114434 -0.1761773 -0.6280311 -0.6662529 0.0418109 0.0060126 0.0566083 -0.8150581 -0.1247256 -0.0716139 -0.0634409 -0.3172186 0.144705 0.0287112 -0.0034859 -0.0642225 0.1400148 0.0125975 -0.1801794 0.0211204 0.1075888 -0.2309663 0.2525637 0.0506052 0.3486069 0.3462954 0.0957082 0.0766257 0.0504937 0.3669126 -0.2541059 -0.2144906 -0.0463422 -0.1565088 0.0125042 -0.010008 -0.0399964 0.01454 0.0104567 1.0652664 -0.049973 -0.0291251 0.0208138 0.7673305 0.1257626 0.2026539 0.0461687 0.0193602 -0.050089 0.0183266 -0.0277791 0.0475092 0.0380778 0.0159973 0.0460259 -0.0168891 0.0227106 0.0155016 0.0288927 -0.0006363 0.0162214 -0.0447362 0.0525805 0.0390968 0.0794076 -0.0437193 0.0592809 0.0186126 0.0323326 -0.0429422 0.0318649 0.0039121 -0.057085 -0.0582894 0.0233529 0.0589848 0.0266213 -0.0170876 -0.0591894 0.019776 -0.0020801 -0.0008098 0.0492386 0.0060901 -0.0509395 -0.1088927 -0.0490551 -0.1271176 -0.0991661 -0.0354728 -0.0584882 -0.0379131 0.0077537 0.0565709 -0.0297336 0.0049469 -0.0779182 -0.0935016 0.0709479 0.0131634 0.0970476 -0.0360926 -0.0205623 0.1180047 0.0055688 0.1183677 -0.083234 -0.012864 -0.0071708 -0.0119265 0.0191802 0.0278716 -0.0488266 -0.0422545 -0.1195053 -0.0018126 -0.0600682 -0.0706925 -0.0368684 0.0744442 0.0650231 -0.0252138 0.015451 0.0225137 -0.0794531 0.1347819 -0.0182899 0.1525189 -0.020139 -0.0221505 0.0593317 0.0869628 0.0640394 0.064568 -0.0545187 0.1269899 -0.0801935 -0.0983015 -0.1251683 0.0907636 -0.0719232 0.094044 0.0331228 0.0293379 -0.0557042 0.0293196 0.0746785 0.0465328 0.0257704 0.1082064 0.0382968 0.0592567 -0.0817436 0.1130876 -0.0484026 -0.1101764 0.0185925 -0.095269 -0.0193803 -0.0835838 -0.0249959 -0.0131948 -0.079618 -0.0740977 0.0874015 0.0413088 0.0521734 0.0339382 0.1169992 -0.0587379 -0.0327034 0.0108872 0.0144602 0.084078 0.0393371 0.0427549 -0.1101415 0.0245142 0.0860364 0.0515152 -0.0569018 0.0522327 -0.1148959 -0.0664058 -0.1341223 0.0068533 -0.129457 -0.0205731 -0.0262026 -0.0158014 -0.041255 0.0685525 -0.0043027 0.0094195 0.1404942 0.0134555 0.0890313 0.011643 0.1145144 0.0136103 -0.0880036 0.0595993 0.0623478 -0.0185305 0.1118101 -0.0563078 0.0145177 0.0220398 -0.0382725 0.0807686 -0.0656974 -0.1221576 -0.0665299 -0.1314021 -0.0190675 -0.0317883 -0.043995 -0.015143 0.0671556 0.3576185 0.1751242 0.016017 0.0422526 0.2366284 0.026293 0.0027052 0.0787107 0.3360933 unknown
polarizability: 106.1263475|-0.4564533|87.9419959|-2.7307803|1.1404248|83.6564336 unknown
InChI: InChI=1S/C8H16O2/c1-5(2)7(9)8(10)6(3)4/h5-7,9H,1-4H3
charge 0 multiplicity 1
26 atoms
O  -1.628757 -1.003354 -1.264453
O  0.906231 -1.497352 -0.60684
C  -1.550566 0.620504 0.620532
C  -0.885451 0.116772 -0.708706
C  1.612887 0.802594 -0.170885
C  0.581262 -0.278859 -0.493082
C  -2.955243 1.180663 0.301861
C  -1.624876 -0.508621 1.673205
C  2.626377 0.889066 -1.346939
C  2.336378 0.480038 1.162731
H  -0.921831 1.446631 1.015022
H  -0.91528 0.950507 -1.443278
H  1.091165 1.775076 -0.079079
H  -3.569308 0.399668 -0.179876
H  -2.900472 2.046019 -0.385278
H  -3.464544 1.508583 1.226614
H  -0.628569 -0.918482 1.922647
H  -2.082173 -0.132967 2.606319
H  -2.248664 -1.336897 1.293601
H  3.141223 -0.079251 -1.473351
H  2.129154 1.142864 -2.300935
H  3.3823 1.666545 -1.135896
H  1.635817 0.472352 2.017522
H  2.816881 -0.511955 1.101128
H  3.115426 1.237015 1.363908
H  -1.027467 -1.799962 -1.194094
