program: Gaussian 09
title: 000229396
version: EM64L-G09RevD.01
frameworkgroup: C1[X(C18H28O2)]
method: RPBEPBE
basis: SDD
operation: Freq
keyword: #pfreq=noraman
keyword: PBEPBE/SDD
title: #p freq=noraman PBEPBE/SDD
converged: YES YES NO NO
title: Mulliken charges:
elementType: O O C C C C C C C C C C C C C C C C C C H H H H H H H H H H H H H H H H H H H H H H H H H H H H
charge: -0.286717 -0.224463 0.144459 0.299123 -0.412236 0.508872 -0.719657 -0.780863 -0.730394 -0.727905 -0.718481 -0.408987 -0.388304 -0.365223 -0.441451 0.348653 0.217265 -0.487428 -0.339645 -0.683819 0.189533 0.191781 0.218003 0.224140 0.208978 0.213959 0.221159 0.213390 0.212745 0.210564 0.211193 0.205091 0.206407 0.230974 0.201027 0.226913 0.219600 0.228385 0.252913 0.298362 0.251521 0.241884 0.242754 0.218909 0.216176 0.208492 0.208736 0.223611
chargesum: 0.00000
title: Mulliken charges with hydrogens summed into heavy atoms:
elementType: O O C C C C C C C C C C C C C C C C C C
charge: -0.286717 -0.224463 0.144459 0.299123 -0.030922 0.508872 -0.068536 -0.132356 -0.095891 -0.085433 -0.070941 -0.180602 -0.135392 -0.066861 -0.189930 0.348653 0.217265 -0.002789 0.095440 -0.042979
polarizability: 2.82600358e+02 1.10342934e+01 1.63987547e+02 -3.92753315e+00 1.33626262e+01 1.73346480e+02
1716.lowfreq: -22.7106 -4.4573 -0.0010 -0.0006 -0.0003 5.1704 18.3978 24.9266 27.3313
frequency: 17.6141 24.4378 27.2730 38.9073 53.2152 61.1447 73.0365 95.7654 140.9529 156.2867 169.3414 198.0008 211.1255 225.2091 228.2093 238.3120 244.4675 248.5511 268.2855 283.7046 290.9937 315.3839 327.5547 339.3486 348.2442 359.4605 381.8121 384.5375 410.0888 416.5579 428.5266 473.6206 504.3436 520.8572 536.2238 577.3999 624.5259 655.8217 700.5447 734.6886 735.2452 739.7115 775.5036 827.5042 838.4959 850.1809 866.0652 867.3741 874.9872 907.0246 920.4654 926.2219 928.7770 934.7684 938.2069 962.1905 975.5662 980.1213 1002.4401 1007.5335 1021.2323 1032.1047 1052.3145 1085.3202 1097.0670 1099.8876 1115.0918 1125.3545 1134.5937 1154.7026 1160.4568 1193.1556 1209.1935 1217.4222 1217.7097 1252.0007 1256.1236 1283.7758 1287.2158 1308.0410 1324.7247 1338.4681 1358.9753 1364.4947 1370.4770 1376.4477 1378.8759 1394.6641 1396.1597 1403.9221 1409.0967 1438.1130 1452.2010 1458.1075 1462.0178 1464.7436 1465.8623 1472.0316 1472.9762 1478.6963 1479.1784 1481.4618 1485.5205 1487.4651 1491.9129 1495.8928 1501.6850 1580.9610 1613.6900 1648.3386 2952.5452 2962.8009 2970.3446 2971.0900 2974.3244 2976.8223 2978.5664 2986.3238 3003.8448 3007.1616 3029.3112 3050.7155 3054.7541 3060.0837 3062.2655 3064.7993 3068.5283 3069.0165 3077.6058 3077.7243 3078.1759 3081.4697 3083.3633 3090.1254 3131.1109 3147.6009 3168.5877 3206.6285
redmass: 2.2949 8.0527 2.2481 2.6392 3.6565 4.0283 3.9295 2.9937 2.8995 3.0749 2.3914 1.5988 2.8058 2.0280 1.1029 1.6453 1.2294 2.0101 1.2193 1.8137 2.4975 3.2162 1.2247 3.6545 2.8514 2.2931 3.0203 2.5408 2.3006 2.3106 3.1592 2.6286 2.6976 3.1070 2.9033 2.7090 6.9789 4.7921 6.4421 2.8825 1.2718 3.4616 6.3893 2.4130 1.3250 1.5724 1.3279 1.9361 3.1243 2.0505 1.7664 1.5505 2.5621 1.4673 1.2720 1.3672 1.7195 1.3607 1.3844 2.7510 1.4050 1.4096 2.3753 3.0688 1.6235 2.0069 1.9412 2.4819 1.7468 2.2002 1.8452 2.5561 1.4121 2.9414 1.3418 3.1540 3.3582 1.0934 1.4872 1.2845 1.5505 1.3459 1.7647 5.0525 1.2067 1.2045 1.2019 1.2149 1.2455 1.2302 3.0252 1.0860 1.0712 1.0566 1.0500 1.0483 1.0819 1.0584 1.0551 1.0573 1.0422 1.0636 1.0781 1.0634 2.1489 1.0656 1.0572 6.9928 6.4117 10.0805 1.0590 1.0351 1.0366 1.0347 1.0362 1.0367 1.0372 1.0613 1.0607 1.0996 1.0978 1.1005 1.0995 1.0991 1.0996 1.0994 1.0992 1.0984 1.1020 1.0998 1.0989 1.0992 1.0986 1.0965 1.0895 1.0873 1.0962 1.0941
irintensity: 0.0589 1.3136 0.8422 0.0150 0.0366 0.1273 0.6267 1.8737 0.5047 0.6439 0.2882 0.4662 0.8813 0.4957 0.0991 1.0941 0.0511 3.9883 0.5253 0.5883 2.5505 3.3534 0.1549 3.3365 0.2504 0.3386 0.2796 0.7004 0.0183 0.0322 0.2133 0.0313 1.6484 5.2566 0.2386 15.5671 1.0421 1.5128 5.9299 2.4685 12.4302 1.7967 1.5733 5.5747 14.0454 52.1592 0.0079 2.1704 2.5423 2.2939 6.9464 1.9541 69.9874 2.4662 0.2632 2.8966 7.4010 2.8364 0.2100 29.0085 1.6718 0.8145 52.3265 247.0439 9.0612 64.2006 6.8567 263.1320 46.2803 131.8344 9.5054 1.3485 61.3677 10.2078 0.4880 22.1502 37.4330 1.6400 65.0795 2.0253 10.0834 5.7379 20.1982 14.9162 10.3584 27.5119 17.6516 7.9937 14.7633 15.1324 9.5450 24.1367 4.2787 1.4840 0.7838 0.5034 2.4293 11.1378 6.0837 17.1333 12.9657 16.9895 14.4776 22.8911 114.6699 32.5987 9.5062 0.8734 3.1258 177.3529 29.4323 39.0429 44.5659 39.8140 39.2053 29.8826 22.1195 7.3277 21.7086 28.6121 1.8588 0.0503 5.8555 46.9448 9.1398 17.4051 25.7450 161.2560 68.3657 46.4471 50.4609 50.4264 17.9668 45.6248 18.6175 7.8906 7.9664 2.6777
temp: 298.150 k
press: 1.00000 atm
elementType: 8 8 6 6 6 6 6 6 6 6 6 6 6 6 6 6 6 6 6 6 1 1 1 1 1 1 1 1 1 1 1 1 1 1 1 1 1 1 1 1 1 1 1 1 1 1 1 1
symmnumber: 1
zpe: 1091164.0 jmol-1
zpe.correction: 0.415602 hartree
zpe.thermalcorrener: 0.438703 hartree
zpe.thermalcorrenthalpy: 0.439647 hartree
zpe.thermalcorrgfe: 0.361674 hartree
zpe.sumelectzpe: -851.604183 hartree
zpe.sumelectthermal: -851.581082 hartree
zpe.sumelectthermalent: -851.580138 hartree
zpe.sumelectthermalfe: -851.658111 hartree
dipole: -0.3766 -0.8063 -1.3018
dipole: 1.5769
quadrupole: -110.0243 -124.6415 -124.1306
quadrupole: -0.1999 -6.8446 0.3745
quadrupole: 9.5745 -5.0427 -4.5318 -0.1999 -6.8446 0.3745
hfenergy: -852.019785 hartree
pointgroup: C01 [X(C18H28O2)]
dipole: -0.1245584 -0.2028668 -0.5728984 debye
polarizability: 283.1267311|6.1907865|158.4271907|4.5860337|10.8889068|178.3804634 unknown
InChI: InChI=1S/C18H28O2/c1-7-8-16(19)20-15-11-9-14(10-12-15)18(5,6)13-17(2,3)4/h9-12H,7-8,13H2,1-6H3
charge 0 multiplicity 1
48 atoms
O  2.897734 -0.302886 -0.468191
O  3.583901 0.408863 1.672445
C  -2.877026 -0.934688 0.007027
C  -3.805463 1.67006 -0.126346
C  -3.606519 0.310796 0.635916
C  -1.346836 -0.722708 -0.112776
C  -3.099102 -2.119414 1.007287
C  -3.5139 -1.356802 -1.341561
C  -4.18515 2.722639 0.957835
C  -4.984007 1.60562 -1.13975
C  -2.525226 2.161073 -0.850676
C  -0.586105 -0.315804 1.015626
C  -0.631272 -0.976969 -1.312117
C  0.815307 -0.152028 0.973997
C  0.76817 -0.824146 -1.383517
C  1.487556 -0.411122 -0.243476
C  3.850932 0.090619 0.495076
C  5.23042 0.054293 -0.142478
C  6.348285 0.539728 0.801319
C  7.73519 0.469548 0.129222
H  -4.617553 -0.036515 0.938848
H  -3.080059 0.54558 1.583368
H  -2.735428 -1.867978 2.020111
H  -2.559721 -3.022741 0.668566
H  -4.175658 -2.363757 1.082172
H  -3.132534 -2.343005 -1.66721
H  -4.609259 -1.444462 -1.227792
H  -3.315826 -0.632105 -2.150187
H  -3.351372 2.880331 1.667964
H  -5.070659 2.397756 1.537689
H  -4.423987 3.697146 0.49159
H  -5.915537 1.27386 -0.641716
H  -5.170286 2.609521 -1.567366
H  -4.785209 0.919449 -1.979394
H  -2.699279 3.166321 -1.280808
H  -1.668648 2.22965 -0.156063
H  -2.228613 1.488994 -1.674824
H  -1.089937 -0.116289 1.968207
H  -1.161856 -1.298198 -2.212955
H  1.368673 0.165512 1.857973
H  1.313852 -1.020613 -2.311624
H  5.42255 -0.984643 -0.477506
H  5.198647 0.661843 -1.067946
H  6.338898 -0.071796 1.722688
H  6.131952 1.576202 1.121281
H  7.984628 -0.566288 -0.169589
H  7.774308 1.099959 -0.7793
H  8.526222 0.820592 0.81606
