program: Gaussian 09
title: 000229387
version: EM64L-G09RevD.01
frameworkgroup: C1[X(C14H28O2)]
method: RPBEPBE
basis: SDD
operation: Freq
keyword: #pfreq=noraman
keyword: PBEPBE/SDD
title: #p freq=noraman PBEPBE/SDD
converged: YES YES NO NO
title: Mulliken charges:
elementType: O O C C C C C C C C C C C C C C H H H H H H H H H H H H H H H H H H H H H H H H H H H H
charge: -0.261570 -0.245522 -0.382153 -0.382683 -0.385271 -0.371999 -0.375287 -0.353720 -0.377417 -0.356259 -0.322195 -0.696609 -0.487022 0.252986 -0.350100 -0.682738 0.191972 0.195368 0.191683 0.194105 0.194199 0.200654 0.190195 0.188851 0.189976 0.200865 0.188428 0.187413 0.231987 0.207374 0.194555 0.194999 0.229993 0.222150 0.209589 0.209903 0.215114 0.231648 0.239384 0.207650 0.228926 0.222420 0.208493 0.209662
chargesum: 0.00000
title: Mulliken charges with hydrogens summed into heavy atoms:
elementType: O O C C C C C C C C C C C C C C
charge: -0.261570 -0.245522 0.005188 0.003105 0.009583 0.007048 0.015554 0.022122 0.061944 0.033295 0.129948 -0.062004 -0.015990 0.252986 0.086475 -0.042163
polarizability: 2.12205111e+02 6.20817236e+00 1.38883207e+02 -1.08486084e+00 1.90506235e+00 1.33081126e+02
1716.lowfreq: -12.7025 -1.3768 -0.0008 -0.0006 0.0002 5.1122 7.2096 15.9308 18.3905
frequency: 1.6340 15.3890 18.0410 29.3416 37.6829 54.0340 68.1087 68.5259 88.2725 108.4426 111.1245 126.4937 142.4186 145.1212 147.8670 188.3111 214.4949 231.6965 234.1654 290.5116 308.5352 317.2186 349.3883 405.4412 436.0272 486.8457 500.9207 584.1571 664.7104 718.5545 723.3190 735.9752 739.9431 758.3358 791.9992 827.2581 849.3125 867.4425 887.9471 889.1239 908.9649 951.2326 972.0090 987.7681 1000.0940 1022.9779 1028.9842 1053.0393 1054.3290 1066.1374 1079.9250 1080.1870 1083.7513 1088.3695 1109.4562 1123.7483 1143.1009 1168.0974 1187.0507 1210.1094 1216.6039 1221.7030 1245.5636 1248.1116 1274.1204 1277.2621 1278.2494 1279.3346 1287.3574 1290.9838 1295.8802 1298.3326 1300.1248 1310.5945 1337.3741 1352.5782 1354.4008 1356.0627 1359.4773 1373.2970 1387.9928 1393.2522 1443.6724 1451.9141 1459.2594 1459.4899 1463.4708 1465.6055 1470.0177 1474.7160 1475.7584 1477.2784 1478.6583 1481.7487 1486.5854 1486.9073 1488.9544 1639.5960 2948.3822 2949.1775 2951.7968 2953.5157 2957.6412 2963.8613 2967.4651 2971.2328 2974.0315 2978.3432 2982.0994 2987.1959 2990.5341 2994.6882 2998.7834 3003.5819 3016.8421 3017.8675 3029.6958 3040.0022 3041.0047 3053.4242 3059.1122 3067.8515 3070.0800 3077.0644 3079.9200 3097.5181
redmass: 2.4427 2.5895 2.7922 2.4296 4.3108 2.7579 3.3499 1.6073 2.9876 1.9221 2.2856 3.1350 2.5447 2.1473 2.6414 3.8086 3.5397 1.0871 1.1035 3.0898 4.6978 3.2127 3.4378 3.2622 3.4171 3.0416 3.2170 3.6260 3.8690 1.0604 1.0749 1.0940 1.1696 1.1346 1.2323 2.8233 1.4499 1.3633 1.9174 2.1584 1.2547 3.5025 1.2270 4.9098 4.0577 1.1020 3.7094 2.8983 2.5490 2.9214 2.3022 2.0879 2.2496 2.0749 2.3705 2.9334 2.6374 1.8134 1.6921 1.2766 1.4470 1.3412 1.2992 1.3161 1.2341 1.2154 1.2252 1.0546 1.0544 1.1406 1.1024 1.2449 1.1719 1.3310 1.4047 1.5492 1.6310 1.6472 1.6259 1.4143 1.2175 1.2157 1.0874 1.0928 1.0739 1.0722 1.0683 1.0734 1.0800 1.0504 1.0824 1.0436 1.0437 1.0867 1.0797 1.0901 1.0954 9.1796 1.0588 1.0587 1.0593 1.0590 1.0593 1.0590 1.0587 1.0363 1.0365 1.0650 1.0963 1.0967 1.0635 1.0970 1.0620 1.1020 1.1039 1.0577 1.1047 1.1045 1.0964 1.1036 1.0974 1.1007 1.0993 1.0992 1.1009 1.1085
irintensity: 0.0246 0.1915 0.5986 0.0904 1.0975 0.0075 0.1956 0.0714 0.8642 0.0704 0.1550 1.1621 0.8088 0.0317 0.5866 0.6519 1.4116 0.0121 0.0005 11.9301 9.0758 1.5077 1.7984 2.0150 0.4130 0.7330 0.6674 8.0243 5.9425 15.8806 0.1291 6.5504 14.1208 0.2636 2.2624 2.1406 3.5661 0.2154 5.6497 2.2342 1.3516 68.3674 3.6628 10.8735 2.8136 0.0977 6.3465 5.8597 3.3101 3.5774 2.3575 0.0958 23.2217 64.6205 28.6644 19.2407 241.7806 11.0980 1.6679 13.7952 1.9981 7.3194 0.9020 2.7535 0.3246 17.1964 6.0791 0.5710 0.1385 0.2963 0.5283 27.8840 15.2593 3.0995 0.1743 2.3876 20.1883 6.7116 0.4349 1.8258 11.0566 8.1343 21.6401 8.0760 0.0406 0.1992 0.2324 0.1680 0.4955 5.2858 1.7097 12.0942 12.2958 1.1712 17.4598 0.9877 39.2540 149.2416 0.0832 0.0870 0.1645 4.5816 1.9205 45.5862 197.1017 38.9491 36.6944 6.1111 0.3197 0.2851 20.5919 3.0033 27.4532 0.6901 3.4851 48.7380 0.2637 161.1612 0.7032 64.8014 2.0143 97.3925 55.3067 47.7169 76.3129 32.8236
temp: 298.150 k
press: 1.00000 atm
elementType: 8 8 6 6 6 6 6 6 6 6 6 6 6 6 6 6 1 1 1 1 1 1 1 1 1 1 1 1 1 1 1 1 1 1 1 1 1 1 1 1 1 1 1 1
symmnumber: 1
zpe: 1035657.8 jmol-1
zpe.correction: 0.394461 hartree
zpe.thermalcorrener: 0.415928 hartree
zpe.thermalcorrenthalpy: 0.416873 hartree
zpe.thermalcorrgfe: 0.336081 hartree
zpe.sumelectzpe: -699.413659 hartree
zpe.sumelectthermal: -699.392192 hartree
zpe.sumelectthermalent: -699.391247 hartree
zpe.sumelectthermalfe: -699.472039 hartree
dipole: -0.4311 -0.5148 -1.4267
dipole: 1.5768
quadrupole: -97.8733 -100.2920 -105.9306
quadrupole: 1.1083 -5.7676 -1.0097
quadrupole: 3.4920 1.0733 -4.5653 1.1083 -5.7676 -1.0097
hfenergy: -699.80812 hartree
pointgroup: C01 [X(C14H28O2)]
dipole: 0.1763624 -0.2031621 -0.558978 debye
polarizability: 212.2342931|5.714689|134.6635664|-2.3023759|-3.143182|137.2715844 unknown
InChI: InChI=1S/C14H28O2/c1-3-5-6-7-8-9-10-11-13-16-14(15)12-4-2/h3-13H2,1-2H3
charge 0 multiplicity 1
44 atoms
O  -3.686359 0.469646 -1.21379
O  -4.06815 0.907387 1.048066
C  2.667154 0.611118 -0.349008
C  3.81711 -0.336245 0.060892
C  1.275565 -0.058496 -0.302412
C  5.209671 0.330514 -0.004498
C  0.130334 0.892362 -0.71824
C  6.36331 -0.614298 0.400997
C  -1.256252 0.207482 -0.696146
C  7.755099 0.054625 0.32986
C  -2.368916 1.172247 -1.12595
C  8.90344 -0.895462 0.733189
C  -5.772064 -0.285761 -0.297358
C  -4.447659 0.414231 -0.039908
C  -6.356124 -0.955811 0.965908
C  -7.757811 -1.546202 0.708028
H  2.855646 0.99171 -1.374958
H  2.669556 1.499634 0.31673
H  3.808305 -1.230071 -0.597848
H  3.636582 -0.708592 1.091037
H  1.274301 -0.9468 -0.968235
H  1.082882 -0.437362 0.722639
H  5.219328 1.223975 0.654768
H  5.388125 0.704059 -1.034847
H  0.334519 1.283867 -1.737067
H  0.121562 1.771018 -0.040259
H  6.189239 -0.98627 1.432553
H  6.354444 -1.509155 -0.256481
H  -1.473951 -0.165565 0.322458
H  -1.251421 -0.666769 -1.375988
H  7.926904 0.428085 -0.700501
H  7.763507 0.947303 0.988455
H  -2.462048 2.012799 -0.41422
H  -2.205581 1.552675 -2.148356
H  8.938444 -1.779606 0.06867
H  8.769528 -1.2612 1.768867
H  9.886142 -0.391867 0.67716
H  -6.482975 0.480572 -0.670887
H  -5.639519 -1.010458 -1.120266
H  -5.66896 -1.753654 1.307917
H  -6.394939 -0.210204 1.780898
H  -8.157943 -2.030543 1.617019
H  -8.472884 -0.758463 0.403746
H  -7.733042 -2.306258 -0.095636
