program: Gaussian 09
title: 000229385
version: EM64L-G09RevD.01
frameworkgroup: C1[X(C13H26O2)]
method: RPBEPBE
basis: SDD
operation: Freq
keyword: #pfreq=noraman
keyword: PBEPBE/SDD
title: #p freq=noraman PBEPBE/SDD
converged: YES YES NO NO
title: Mulliken charges:
elementType: O O C C C C C C C C C C C C C H H H H H H H H H H H H H H H H H H H H H H H H H H
charge: -0.260687 -0.249907 -0.383249 -0.381795 -0.383676 -0.372661 -0.375734 -0.353193 -0.377297 -0.356586 -0.324406 -0.696437 0.278125 -0.485191 -0.662863 0.192416 0.195147 0.191688 0.193910 0.194254 0.200278 0.190162 0.189033 0.190682 0.200206 0.187359 0.188361 0.232736 0.207343 0.194991 0.194611 0.229845 0.222064 0.209568 0.209892 0.215101 0.239988 0.241344 0.221835 0.237878 0.214866
chargesum: 0.00000
title: Mulliken charges with hydrogens summed into heavy atoms:
elementType: O O C C C C C C C C C C C C C
charge: -0.260687 -0.249907 0.004314 0.003804 0.010856 0.006534 0.015154 0.022528 0.062781 0.033016 0.127503 -0.061876 0.278125 -0.003858 0.011715
polarizability: 1.95817520e+02 5.50424102e+00 1.30047073e+02 -2.13575030e+00 1.81344442e+00 1.23602442e+02
1716.lowfreq: -7.0245 -4.9358 -0.0012 -0.0007 0.0009 3.8106 10.6993 26.2050 29.4346
frequency: -2.6162 25.4991 29.3593 36.5179 46.6803 62.9431 77.6254 78.2344 116.5420 117.9834 122.2605 150.1387 150.8975 173.5240 185.4579 208.2748 220.5597 227.9309 299.9467 319.7901 332.6076 405.8689 441.0637 487.1893 503.2777 573.9154 630.6227 721.5494 726.0451 738.7255 759.2117 783.8341 792.5297 807.2723 850.8170 888.3454 908.3803 917.0891 974.1043 986.2661 1000.5972 1014.7656 1025.5068 1029.9867 1053.8162 1065.9569 1077.6332 1080.3283 1080.7846 1083.9073 1086.3914 1123.0701 1134.6038 1168.6502 1187.5626 1210.4857 1217.3711 1244.0779 1246.7471 1248.6717 1274.9908 1279.0090 1281.2478 1289.5817 1292.2964 1298.3568 1301.0672 1312.5967 1334.4371 1339.9963 1354.1834 1356.8666 1359.8049 1373.0097 1388.8386 1397.4054 1445.4012 1453.1906 1460.8771 1461.2125 1465.2233 1466.7362 1470.8195 1471.3599 1476.1331 1476.6716 1481.9179 1483.0386 1486.9124 1489.3018 1643.7335 2949.2060 2949.6078 2952.2038 2953.7843 2958.0875 2964.1023 2968.0167 2971.5838 2982.5746 2987.6217 2990.2180 2992.4110 2994.9638 2997.9869 3004.2688 3017.0305 3017.3466 3030.0173 3040.3656 3054.0121 3055.4276 3067.7750 3070.4138 3093.5923 3097.9840 3104.3569
redmass: 2.2305 4.0844 3.3537 1.8238 4.3634 3.1628 1.6684 2.9822 1.8266 2.6667 2.7367 2.0324 1.9755 3.8027 1.3458 3.0647 2.7986 1.1314 3.5950 3.4988 3.9357 3.2243 3.4121 2.9997 3.0953 3.4967 3.7347 1.0605 1.0753 1.0938 1.1439 1.7064 1.3346 1.7266 1.3017 1.8982 1.8311 2.3259 1.2003 4.7978 4.0127 1.9060 1.2473 2.5850 3.0660 2.8965 2.3324 2.2733 2.1119 1.9052 2.5743 2.9041 3.1677 1.8080 1.6849 1.2748 1.4450 1.1849 1.2903 1.3154 1.2304 1.2241 1.0571 1.0589 1.1410 1.1032 1.1207 1.3128 1.5917 1.4702 1.5963 1.6276 1.6213 1.4099 1.2181 1.2097 1.0881 1.0908 1.0746 1.0742 1.0676 1.0734 1.0767 1.0416 1.0806 1.0435 1.0859 1.0518 1.0923 1.0956 8.7826 1.0588 1.0589 1.0594 1.0591 1.0594 1.0590 1.0586 1.0365 1.0962 1.0961 1.0636 1.0629 1.0977 1.0375 1.1020 1.0777 1.0833 1.1046 1.1045 1.1033 1.0955 1.1006 1.0993 1.1005 1.1082 1.1001
irintensity: 0.1253 0.2418 0.4184 0.1622 1.4138 0.7616 0.1427 0.5861 0.1209 0.2374 0.8128 0.0080 0.0763 0.3432 0.4540 1.2050 2.2915 0.0018 12.9073 8.0372 4.3601 1.7472 0.0528 0.7048 0.2937 6.1058 2.6935 15.3072 0.1272 6.9723 1.5004 8.0683 15.4202 2.1290 2.5344 5.0153 10.6008 11.4095 1.0337 1.0464 2.3796 36.9526 0.3149 11.7334 1.2591 5.2639 62.1156 2.6702 3.5500 1.5731 18.2234 52.4424 273.2028 7.8235 1.3750 14.5114 1.9728 2.3766 2.2797 2.6880 0.8017 1.6398 0.5831 0.1606 0.6164 0.0425 0.4324 0.6038 42.2608 10.0057 1.6769 0.3630 0.3702 0.4184 11.1281 19.0245 29.4736 6.3169 0.0091 0.2659 0.2152 0.1808 0.6419 13.2922 1.8774 12.0610 0.7441 16.4210 2.1463 38.1249 144.0468 0.1726 0.0206 0.1575 4.0504 1.3987 57.1194 188.2433 36.9240 0.3047 0.4195 20.2739 19.7599 2.3815 24.5930 0.7533 28.2868 22.6634 0.2794 161.6062 59.7493 8.2003 97.3294 56.4308 35.8048 33.1013 30.1417
temp: 298.150 k
press: 1.00000 atm
elementType: 8 8 6 6 6 6 6 6 6 6 6 6 6 6 6 1 1 1 1 1 1 1 1 1 1 1 1 1 1 1 1 1 1 1 1 1 1 1 1 1 1
symmnumber: 1
zpe: 962939.8 jmol-1
zpe.correction: 0.366764 hartree
zpe.thermalcorrener: 0.385811 hartree
zpe.thermalcorrenthalpy: 0.386755 hartree
zpe.thermalcorrgfe: 0.316344 hartree
zpe.sumelectzpe: -660.190401 hartree
zpe.sumelectthermal: -660.171355 hartree
zpe.sumelectthermalent: -660.170411 hartree
zpe.sumelectthermalfe: -660.240822 hartree
dipole: -0.4360 -0.9073 -1.3197
dipole: 1.6598
quadrupole: -92.1578 -95.0160 -98.2581
quadrupole: -1.1134 -6.7675 -2.4184
quadrupole: 2.9862 0.1280 -3.1141 -1.1134 -6.7675 -2.4184
hfenergy: -660.5571658 hartree
pointgroup: C01 [X(C13H26O2)]
dipole: 0.1788672 0.1337434 0.6136236 debye
polarizability: 195.8111058|-5.7035857|124.8619247|1.8097672|-3.049764|128.7940047 unknown
InChI: InChI=1S/C13H26O2/c1-3-5-6-7-8-9-10-11-12-15-13(14)4-2/h3-12H2,1-2H3
charge 0 multiplicity 1
41 atoms
O  -4.241877 -0.233613 1.062859
O  -4.547849 -0.478949 -1.239292
C  2.122023 -0.606049 0.332903
C  3.311522 0.307265 -0.039591
C  0.757949 0.117875 0.283839
C  4.679245 -0.408484 0.031821
C  -0.432556 -0.799323 0.644143
C  5.868686 0.502656 -0.346302
C  -1.787914 -0.054425 0.623193
C  7.237325 -0.211488 -0.266346
C  -2.95423 -0.988596 0.970757
C  8.420033 0.705815 -0.645511
C  -4.947977 -0.051072 -0.131992
C  -6.247475 0.694947 0.132816
C  -6.85915 1.298131 -1.145313
H  2.281747 -1.01794 1.351557
H  2.100349 -1.477706 -0.354456
H  3.323863 1.1874 0.637343
H  3.159876 0.706709 -1.064233
H  0.777726 0.982981 0.979309
H  0.600695 0.538144 -0.731082
H  4.666433 -1.291732 -0.641047
H  4.832568 -0.803275 1.058247
H  -0.264581 -1.237579 1.650365
H  -0.465096 -1.650248 -0.067719
H  5.880104 1.389012 0.322618
H  5.720232 0.893201 -1.374992
H  -1.959578 0.380587 -0.379453
H  -1.764978 0.782074 1.348711
H  7.225454 -1.09672 -0.934886
H  7.384678 -0.601505 0.761653
H  -3.064379 -1.785105 0.212153
H  -2.837776 -1.430618 1.974555
H  8.474615 1.581473 0.028877
H  8.310495 1.08632 -1.678748
H  9.385614 0.170791 -0.583063
H  -6.951067 -0.027205 0.593767
H  -6.057545 1.464704 0.902083
H  -6.201023 2.074305 -1.573416
H  -6.999885 0.521402 -1.915677
H  -7.838195 1.75804 -0.923151
