program: Gaussian 09
title: 000229382
version: EM64L-G09RevD.01
frameworkgroup: C1[X(C12H24O2)]
method: RPBEPBE
basis: SDD
operation: Freq
keyword: #pfreq=noraman
keyword: PBEPBE/SDD
title: #p freq=noraman PBEPBE/SDD
converged: NO YES NO NO
title: Mulliken charges:
elementType: O O C C C C C C C C C C C C H H H H H H H H H H H H H H H H H H H H H H H H
charge: -0.223652 -0.232869 -0.384382 -0.383568 -0.381670 -0.379057 -0.373050 -0.380791 -0.353206 -0.389367 -0.356734 -0.311507 -0.696218 0.010974 0.193804 0.193853 0.194468 0.194372 0.192446 0.192419 0.196266 0.196325 0.189662 0.189698 0.196327 0.196148 0.187842 0.187813 0.215639 0.215776 0.194865 0.194828 0.234753 0.234650 0.209661 0.215252 0.209683 0.208548
chargesum: 0.00000
title: Mulliken charges with hydrogens summed into heavy atoms:
elementType: O O C C C C C C C C C C C C
charge: -0.223652 -0.232869 0.003275 0.005272 0.003195 0.013534 0.006311 0.011684 0.022448 0.042048 0.032959 0.157897 -0.061623 0.219522
polarizability: 1.90292399e+02 1.45690068e+00 1.21104998e+02 -4.45461590e-02 -1.70533293e-02 1.05592291e+02
1716.lowfreq: -3.1069 -0.0008 0.0013 0.0016 7.3119 16.5038 26.2450 27.2319 46.6187
frequency: 22.7165 27.2116 36.8723 53.1232 66.4449 73.7039 88.5889 101.3130 123.7646 130.4113 136.3442 154.1191 160.5517 163.7122 210.1868 227.2948 281.3967 320.3721 336.1370 381.3202 426.2495 477.1116 496.0749 723.3611 725.7122 732.3631 733.1321 748.9027 775.4532 816.1922 858.3081 869.1710 887.6807 927.3229 960.5333 982.8691 983.4486 997.5197 1022.8809 1028.8657 1048.1117 1059.7285 1077.1259 1080.6044 1082.4321 1097.4256 1098.7999 1125.6327 1151.2341 1183.9654 1207.2828 1208.6810 1234.7905 1240.6947 1260.7305 1269.6081 1277.8771 1281.3309 1289.7293 1292.2742 1297.3957 1300.9989 1301.3849 1322.9229 1338.1705 1345.4479 1354.5380 1356.5629 1359.2940 1371.6988 1389.4834 1461.6234 1461.8655 1464.7786 1466.2580 1468.5669 1470.8408 1475.4457 1476.5607 1480.3315 1485.2930 1489.4488 1491.3548 1624.3300 2950.3530 2950.8026 2952.5695 2954.6276 2957.1188 2961.4879 2966.7167 2969.2971 2971.3993 2983.6844 2987.7493 2991.2264 2993.4931 3000.9079 3002.7818 3011.0133 3022.6952 3032.3256 3033.5210 3042.0594 3048.6503 3067.9625 3069.9794 3077.5102
redmass: 4.1159 4.6499 4.3122 2.2666 2.2778 4.3604 1.7281 2.4142 1.7621 4.8125 2.2333 1.9184 2.0756 4.8472 4.0791 1.1305 3.8886 3.8748 2.4679 3.3373 3.3405 3.1317 3.0432 1.0591 1.0692 7.5370 1.0844 1.1063 1.1463 1.1940 6.7595 1.2213 1.9051 1.2159 1.6027 5.0160 1.1705 4.3404 3.8220 1.0785 3.2774 3.0711 2.5538 2.1192 2.3013 2.5737 6.8084 3.1948 1.4253 1.8060 1.5054 1.2744 1.3639 1.2956 1.2659 1.2927 1.1293 1.0423 1.1065 1.0822 1.3083 1.1042 1.1129 1.3448 1.2102 1.3736 1.6388 1.6069 1.6155 1.5043 1.2174 1.0727 1.0725 1.0676 1.0751 1.0726 1.0814 1.0804 1.0423 1.0837 1.0900 1.0941 1.0991 8.5648 1.0585 1.0586 1.0591 1.0591 1.0592 1.0592 1.0588 1.0584 1.0368 1.0962 1.0974 1.0598 1.0991 1.1013 1.0566 1.1034 1.1045 1.0916 1.1047 1.1044 1.1045 1.1007 1.0992 1.1081
irintensity: 0.1450 0.2102 1.0622 0.1632 0.0720 0.5708 0.0701 0.0215 0.0463 1.4790 0.0777 0.0230 0.0340 0.1492 3.0998 0.0004 5.7524 0.3738 29.0442 3.1446 1.3674 0.9440 1.3035 16.8704 0.4229 3.4632 7.5951 0.2444 1.9130 0.3004 13.9326 0.3425 4.9644 0.5629 3.2308 0.2125 0.0357 2.9797 0.5124 0.2477 0.5612 6.2279 15.0881 0.2496 0.2377 4.3508 371.2088 0.3868 1.8463 0.4281 0.0537 14.4113 0.0701 0.3237 0.0015 0.6811 0.3914 0.2635 0.1919 0.0334 0.2195 0.2246 0.0051 2.1681 7.9736 0.3975 1.2013 0.4690 0.4806 10.6113 11.3337 0.0133 0.0138 0.0451 0.1035 1.0628 0.4106 3.0430 12.3701 0.2645 3.0694 1.9114 43.6210 294.1375 0.0159 0.2323 0.1931 0.0809 2.1662 4.4070 42.2266 236.0101 34.9907 0.0057 0.0490 19.4850 0.2582 0.4831 38.8973 0.2200 4.7720 63.2388 0.3525 146.9058 89.5491 99.7388 55.1769 80.3662
temp: 298.150 k
press: 1.00000 atm
elementType: 8 8 6 6 6 6 6 6 6 6 6 6 6 6 1 1 1 1 1 1 1 1 1 1 1 1 1 1 1 1 1 1 1 1 1 1 1 1
symmnumber: 1
zpe: 890567.9 jmol-1
zpe.correction: 0.339199 hartree
zpe.thermalcorrener: 0.357530 hartree
zpe.thermalcorrenthalpy: 0.358474 hartree
zpe.thermalcorrgfe: 0.289573 hartree
zpe.sumelectzpe: -620.952159 hartree
zpe.sumelectthermal: -620.933829 hartree
zpe.sumelectthermalent: -620.932885 hartree
zpe.sumelectthermalfe: -621.001785 hartree
dipole: -2.2870 -1.2260 0.0098
dipole: 2.5949
quadrupole: -112.2736 -93.3245 -86.7954
quadrupole: -11.6204 0.0783 0.0168
quadrupole: -14.8091 4.1400 10.6691 -11.6204 0.0783 0.0168
hfenergy: -621.2913588 hartree
pointgroup: C01 [X(C12H24O2)]
dipole: 0.9013515 0.4788219 0.0233659 debye
polarizability: 190.2996883|1.2115043|121.0774533|0.4225744|0.5364458|105.6125464 unknown
InChI: InChI=1S/C12H24O2/c1-2-3-4-5-6-7-8-9-10-11-14-12-13/h12H,2-11H2,1H3
charge 0 multiplicity 1
38 atoms
O  -5.768614 0.717345 -0.006149
O  -7.280693 -1.071324 -0.08297
C  1.816956 0.490579 0.013385
C  0.51035 -0.33416 -0.011828
C  3.091387 -0.383157 -0.00502
C  -0.763373 0.540242 0.0072
C  4.398895 0.440382 0.01912
C  -2.068816 -0.286461 -0.021484
C  5.673215 -0.433646 0.000321
C  -3.335658 0.600385 0.000276
C  6.981364 0.389792 0.026025
C  -4.613314 -0.23723 -0.03397
C  8.248765 -0.49179 0.006088
C  -7.032503 0.14985 -0.035545
H  1.832547 1.17921 -0.857368
H  1.827088 1.134022 0.918142
H  0.495688 -1.023151 0.858586
H  0.500907 -0.976998 -0.916963
H  3.076425 -1.071507 0.866003
H  3.0812 -1.027201 -0.909385
H  -0.747684 1.230207 -0.86207
H  -0.755068 1.180971 0.913491
H  4.409737 1.084233 0.923709
H  4.414289 1.128939 -0.851825
H  -2.081717 -0.977528 0.846932
H  -2.075424 -0.925383 -0.929059
H  5.664509 -1.07694 -0.904695
H  5.658977 -1.123019 0.870656
H  -3.328756 1.288054 -0.867252
H  -3.338303 1.230607 0.910448
H  6.994428 1.079008 -0.843129
H  6.989132 1.031535 0.930898
H  -4.690452 -0.849441 -0.951682
H  -4.698417 -0.910845 0.838927
H  8.27304 -1.16981 0.88032
H  9.169809 0.119708 0.026845
H  8.279974 -1.119607 -0.904675
H  -7.78209 0.964035 -0.009803
