program: Gaussian 09
title: 000229379
version: EM64L-G09RevD.01
frameworkgroup: C1[X(C12H22O2)]
method: RPBEPBE
basis: SDD
operation: Freq
keyword: #pfreq=noraman
keyword: PBEPBE/SDD
title: #p freq=noraman PBEPBE/SDD
converged: YES YES NO NO
title: Mulliken charges:
elementType: O O C C C C C C C C C C C C H H H H H H H H H H H H H H H H H H H H H H
charge: -0.281333 -0.244911 -0.016597 -0.452783 -0.444909 -0.436061 -0.430420 -0.376102 -0.525447 -0.355440 0.240422 -0.352962 -0.354227 -0.695311 0.258802 0.199791 0.240499 0.235874 0.227339 0.224978 0.220893 0.215975 0.214343 0.205937 0.224656 0.235043 0.244110 0.187637 0.185662 0.191139 0.189182 0.194369 0.193993 0.210603 0.215132 0.210126
chargesum: 0.00000
title: Mulliken charges with hydrogens summed into heavy atoms:
elementType: O O C C C C C C C C C C C C
charge: -0.281333 -0.244911 0.242204 -0.012493 0.018303 0.009811 -0.000103 0.054491 -0.046295 0.017858 0.240422 0.027360 0.034135 -0.059449
polarizability: 1.74068677e+02 -3.48192963e+00 1.20137738e+02 -3.84286910e-01 5.00430337e-02 1.10195406e+02
1716.lowfreq: -25.4651 -15.7171 -6.7969 -5.2915 -0.0006 0.0007 0.0008 21.4874 32.7885
frequency: -15.2217 17.3847 30.5775 41.0645 56.9390 63.5228 95.6523 121.4737 128.4692 140.4336 179.2611 210.0360 227.6652 238.9985 309.2305 370.7197 390.1427 437.1020 476.7578 556.8323 568.0377 658.0002 705.0040 723.0145 735.5040 767.0905 789.3842 798.2474 850.1862 876.4238 877.7942 889.9064 899.0086 905.4054 938.3393 948.2439 978.0146 1011.7451 1013.0473 1037.2731 1060.8750 1070.7999 1081.6664 1088.7513 1098.7628 1115.9881 1136.9354 1161.0193 1163.5496 1192.3868 1195.0628 1218.4774 1231.9986 1240.1294 1256.0337 1275.7861 1285.0825 1286.1419 1286.4213 1294.9078 1304.2404 1312.7645 1317.3659 1326.6763 1338.3496 1355.2464 1362.9441 1387.4698 1441.4537 1451.2075 1457.3098 1462.8957 1465.0271 1468.6779 1473.0254 1476.2298 1481.5545 1483.1433 1488.1413 1632.6892 2949.4231 2956.0324 2966.7575 2971.7331 2975.8607 2987.1683 2990.8216 2996.1849 2997.5279 3003.9333 3007.1517 3021.5962 3028.7339 3040.2768 3054.1658 3063.9317 3064.1538 3068.5369 3071.1291 3071.8732 3081.5551 3090.0579
redmass: 2.4334 2.4955 3.1140 2.9538 3.6695 2.8390 1.9444 2.7834 2.8508 1.9767 2.9085 3.1991 1.1228 3.9394 3.3820 2.5426 3.4171 3.0971 2.8858 2.5937 2.2536 3.2937 3.2927 1.0760 1.1470 2.4444 1.2910 2.0750 2.0317 1.8342 1.9480 2.2163 2.5134 2.3057 1.4708 3.2500 1.2099 3.1281 1.5791 3.6385 1.9152 2.5143 2.0748 1.6758 1.8037 2.3004 2.3326 1.5931 1.5511 1.6179 1.4311 1.4075 1.3475 1.3227 1.2755 1.1560 1.3331 1.3026 1.0846 1.1130 1.2509 1.3498 1.4799 1.4351 1.4729 1.6391 1.7048 1.2176 1.0858 1.0887 1.0805 1.0684 1.0754 1.0853 1.0712 1.0432 1.0799 1.0982 1.0889 9.9094 1.0590 1.0589 1.0592 1.0362 1.0650 1.0922 1.0665 1.0617 1.0647 1.1004 1.0623 1.0635 1.1026 1.0977 1.0958 1.1000 1.0933 1.1007 1.0993 1.1019 1.1009 1.1037
irintensity: 0.0198 0.0178 0.8143 0.4687 0.6213 0.3088 1.0711 1.0791 1.1854 0.5844 0.3502 0.7449 0.0084 11.5777 3.7379 0.5239 6.2795 1.7862 1.6617 3.7041 0.3306 2.8644 0.2352 14.5758 0.3927 6.4253 6.4129 7.3839 4.9130 4.2242 3.2159 4.9901 8.4396 4.4898 20.1298 48.1344 2.0426 3.6742 3.1876 54.8055 7.6362 0.2378 3.5918 12.9299 111.0511 7.0446 245.7830 3.1096 6.1336 2.5766 2.4608 2.9607 46.2207 6.1625 4.1000 4.7530 0.5214 28.7957 1.3443 4.6598 0.3720 0.9505 1.0308 23.4989 6.4764 7.3855 12.9327 10.7821 19.1275 17.0325 4.8272 0.0349 0.6042 9.8413 3.0334 12.2447 3.0062 7.4407 24.5877 161.2730 6.8738 8.1752 86.4583 38.5364 2.8617 8.0269 39.2660 36.6996 26.6092 1.9277 39.0132 23.2570 34.6153 17.8595 32.9351 26.8250 9.2592 116.8483 54.7364 21.9846 13.1339 90.5646
temp: 298.150 k
press: 1.00000 atm
elementType: 8 8 6 6 6 6 6 6 6 6 6 6 6 6 1 1 1 1 1 1 1 1 1 1 1 1 1 1 1 1 1 1 1 1 1 1
symmnumber: 1
zpe: 835877.0 jmol-1
zpe.correction: 0.318369 hartree
zpe.thermalcorrener: 0.334135 hartree
zpe.thermalcorrenthalpy: 0.335080 hartree
zpe.thermalcorrgfe: 0.272110 hartree
zpe.sumelectzpe: -619.795108 hartree
zpe.sumelectthermal: -619.779342 hartree
zpe.sumelectthermalent: -619.778398 hartree
zpe.sumelectthermalfe: -619.841368 hartree
dipole: 0.8032 -1.6698 0.2157
dipole: 1.8655
quadrupole: -77.4942 -93.2307 -85.0920
quadrupole: 1.3218 -1.1214 0.5586
quadrupole: 7.7781 -7.9584 0.1803 1.3218 -1.1214 0.5586
hfenergy: -620.1134772 hartree
pointgroup: C01 [X(C12H22O2)]
dipole: -0.3320977 0.5678835 0.3253929 debye
polarizability: 174.1882831|-2.4358017|118.5963237|0.0803013|3.4371744|111.6172145 unknown
InChI: InChI=1S/C12H22O2/c1-2-3-4-5-10-12(13)14-11-8-6-7-9-11/h11H,2-10H2,1H3
charge 0 multiplicity 1
36 atoms
O  -1.759701 0.312065 -0.257357
O  -0.597318 -1.597423 -0.927128
C  -3.041592 -0.285906 -0.785378
C  -4.027673 0.88922 -0.904388
C  -3.659205 -1.253697 0.265118
C  -4.631008 1.009868 0.516726
C  -4.830048 -0.470755 0.944088
C  1.941556 -0.276779 -0.295752
C  0.588869 0.243974 0.231686
C  3.141016 0.374949 0.425985
C  -0.606362 -0.466956 -0.384461
C  4.505528 -0.120938 -0.103319
C  5.710756 0.523614 0.618622
C  7.070357 0.026268 0.081781
H  -2.795279 -0.784651 -1.737884
H  -4.818544 0.616843 -1.630853
H  -3.531154 1.805964 -1.264153
H  -2.885277 -1.55292 0.992317
H  -4.011077 -2.179554 -0.222921
H  -5.568866 1.592078 0.540243
H  -3.902929 1.507455 1.184103
H  -4.834341 -0.594309 2.041198
H  -5.803079 -0.8405 0.568533
H  2.011261 -0.08237 -1.384261
H  1.977571 -1.37617 -0.177399
H  0.53157 0.094729 1.33023
H  0.478563 1.331413 0.067515
H  3.087056 1.478824 0.317251
H  3.074643 0.166167 1.514832
H  4.561994 -1.22436 0.003829
H  4.576132 0.088776 -1.191199
H  5.640525 0.311147 1.705173
H  5.651101 1.626406 0.513367
H  7.166826 -1.069378 0.202518
H  7.91543 0.500644 0.613974
H  7.177995 0.254461 -0.99554
