program: Gaussian 09
title: 000229371
version: EM64L-G09RevD.01
frameworkgroup: C1[X(C16H18O)]
method: RPBEPBE
basis: SDD
operation: Freq
keyword: #pfreq=noraman
keyword: PBEPBE/SDD
title: #p freq=noraman PBEPBE/SDD
converged: YES YES NO NO
title: Mulliken charges:
elementType: O C C C C C C C C C C C C C C C C H H H H H H H H H H H H H H H H H H
charge: -0.456293 -0.409660 -0.467485 -0.013929 0.450083 0.475068 -0.715278 -0.443684 -0.433239 -0.406701 -0.386542 -0.230193 -0.234930 -0.251886 -0.238521 -0.241975 -0.244426 0.242399 0.227827 0.212192 0.213088 0.204912 0.231875 0.226266 0.242483 0.234961 0.246697 0.253884 0.353134 0.228116 0.224016 0.227542 0.222620 0.230359 0.227218
chargesum: 0.00000
title: Mulliken charges with hydrogens summed into heavy atoms:
elementType: O C C C C C C C C C C C C C C C C
charge: -0.103159 -0.167261 -0.027467 0.199159 0.450083 0.475068 -0.052225 -0.201201 -0.198278 -0.160004 -0.132658 -0.002077 -0.010913 -0.024345 -0.015900 -0.011616 -0.017208
polarizability: 1.94299324e+02 -1.93721584e+01 1.67052111e+02 -4.78986998e+00 1.10284582e+01 1.43736152e+02
1716.lowfreq: -9.1609 -7.5319 -3.3348 -0.0003 0.0006 0.0009 29.8931 38.3802 45.1630
frequency: 29.7847 38.2782 45.1345 69.2538 75.1177 80.8633 173.9150 205.8333 218.9175 236.8453 252.7090 274.6007 285.8683 391.3387 403.1384 405.2503 415.9254 461.2753 480.6834 482.6219 552.5993 598.0759 616.3794 618.5505 627.1954 706.8873 709.3939 738.6101 760.4583 783.1574 810.3391 849.5374 855.3366 861.3207 909.5026 914.8934 928.7313 936.4741 978.2984 982.9983 990.0937 990.3362 994.4194 998.6273 1007.4762 1027.6146 1029.1489 1056.7196 1059.9279 1082.0495 1097.9890 1134.8738 1171.1079 1173.1297 1184.7480 1187.2506 1190.6231 1193.4866 1212.9475 1242.9844 1259.1194 1298.6918 1308.4305 1329.5895 1348.1579 1356.3294 1368.6971 1378.5584 1390.4342 1391.2672 1437.2327 1445.4122 1457.2760 1467.4970 1478.1474 1481.4435 1483.6423 1589.9091 1592.2544 1609.1914 1613.7917 2961.9083 2981.3882 2987.3236 2989.2282 3043.1073 3086.0276 3097.6387 3110.5104 3114.0335 3120.4287 3122.9129 3134.5334 3135.8778 3144.8062 3147.0850 3161.8441 3163.1961 3538.7198
redmass: 3.8437 4.3819 3.7714 4.4124 3.8141 3.7397 4.5662 2.1581 1.2966 4.1645 3.7395 4.3924 3.4834 1.7180 2.7595 2.7911 1.5078 2.1943 3.5461 3.9148 2.9026 4.7808 6.3887 5.3898 4.6745 1.7524 1.9206 2.3203 1.8656 2.5010 3.1277 3.3736 1.2489 1.2473 1.6885 1.4865 1.5408 1.5833 1.3895 1.3927 5.3521 5.8989 1.3534 1.3106 3.1451 2.1909 2.2035 1.6215 2.1359 1.6422 1.7922 2.0564 1.0691 1.0573 2.5882 1.2348 1.1431 1.1978 2.3308 1.2902 1.3419 1.3697 1.4128 1.2596 1.2647 1.5247 1.4698 6.5627 1.3396 3.5400 2.2156 2.0305 1.0567 1.0938 1.0558 2.1757 2.2582 6.0055 5.8385 6.0495 6.0712 1.0844 1.0635 1.0677 1.0466 1.1017 1.0992 1.1002 1.0873 1.0876 1.0858 1.0858 1.0907 1.0914 1.0957 1.0950 1.1013 1.1014 1.0661
irintensity: 0.0642 0.6780 1.0873 0.1973 0.2633 1.3572 2.3824 0.1197 2.7021 1.0682 0.5592 0.3826 1.1076 90.8549 2.8816 1.3230 72.0646 18.3905 3.2966 4.7282 18.8118 0.7088 0.3117 5.1946 4.2219 56.5861 38.5202 31.6346 32.9588 16.3393 12.8862 13.1911 0.0937 0.0019 10.6568 3.4215 7.0709 0.5160 0.0391 0.0922 0.3649 0.8164 0.2745 0.2527 22.2799 14.7691 10.5537 5.0294 33.9496 7.2198 3.9596 26.4395 0.1855 0.1252 0.9120 5.7448 4.3512 7.1371 6.0123 33.8981 3.5058 2.4478 2.5182 4.9140 12.3229 3.9765 5.6853 1.0641 28.7110 1.6188 12.3111 5.9164 5.9422 8.4666 8.3482 31.6755 14.1555 2.6015 0.3605 19.2534 3.5080 36.5595 7.6377 7.9664 37.7718 27.2262 31.7825 36.1752 8.8624 7.2448 4.0809 0.0834 9.3672 22.3855 30.4178 38.1004 31.3733 20.2474 3.0347
temp: 298.150 k
press: 1.00000 atm
elementType: 8 6 6 6 6 6 6 6 6 6 6 6 6 6 6 6 6 1 1 1 1 1 1 1 1 1 1 1 1 1 1 1 1 1 1
symmnumber: 1
zpe: 771096.6 jmol-1
zpe.correction: 0.293695 hartree
zpe.thermalcorrener: 0.309482 hartree
zpe.thermalcorrenthalpy: 0.310426 hartree
zpe.thermalcorrgfe: 0.249026 hartree
zpe.sumelectzpe: -694.484809 hartree
zpe.sumelectthermal: -694.469022 hartree
zpe.sumelectthermalent: -694.468078 hartree
zpe.sumelectthermalfe: -694.529478 hartree
dipole: -0.0933 -1.4341 -1.1196
dipole: 1.8218
quadrupole: -98.2932 -102.7958 -96.7600
quadrupole: -8.1136 -3.6341 -1.7043
quadrupole: 0.9898 -3.5128 2.5230 -8.1136 -3.6341 -1.7043
hfenergy: -694.778504 hartree
pointgroup: C01 [X(C16H18O1)]
dipole: -0.0707612 0.4413026 0.5603267 debye
polarizability: 191.3549815|20.125391|163.7210131|7.9355786|15.7738788|150.0115919 unknown
InChI: InChI=1S/C16H18O/c1-13(17)12-16(14-8-4-2-5-9-14)15-10-6-3-7-11-15/h2-11,13,16-17H,12H2,1H3
charge 0 multiplicity 1
35 atoms
O  2.352678 -1.821502 -1.581866
C  0.041049 -0.438456 -0.465344
C  0.47956 -1.8313 0.08465
C  1.962907 -2.184972 -0.199501
C  0.933122 0.719379 -0.008106
C  -1.4530 -0.217094 -0.165305
C  2.227074 -3.688427 -0.070409
C  1.227302 1.771751 -0.914867
C  -2.416992 -0.80996 -1.022998
C  1.466052 0.800648 1.30541
C  -1.91126 0.51515 0.958601
C  2.026409 2.870652 -0.527098
C  -3.799005 -0.683665 -0.763844
C  2.266624 1.89658 1.69885
C  -3.294554 0.644344 1.221378
C  2.550581 2.936966 0.784498
C  -4.244539 0.044197 0.364136
H  0.13309 -0.509529 -1.567448
H  -0.172556 -2.592963 -0.384935
H  0.294472 -1.889484 1.175751
H  2.611393 -1.630338 0.511658
H  1.908791 -4.058995 0.921304
H  3.300202 -3.907572 -0.203406
H  1.664049 -4.236734 -0.846688
H  0.813734 1.732748 -1.930867
H  -2.078799 -1.371128 -1.903925
H  1.2572 0.003068 2.028087
H  -1.188022 1.002927 1.62083
H  2.463079 -0.836523 -1.627101
H  2.239469 3.670858 -1.244865
H  -4.526433 -1.145783 -1.441093
H  2.669127 1.938103 2.717483
H  -3.630161 1.218479 2.092801
H  3.172663 3.785898 1.089105
H  -5.316408 0.147774 0.567025
