program: Gaussian 09
title: 000229367
version: EM64L-G09RevD.01
frameworkgroup: C1[X(C17H18O2)]
method: RPBEPBE
basis: SDD
operation: Freq
keyword: #pfreq=noraman
keyword: PBEPBE/SDD
title: #p freq=noraman PBEPBE/SDD
converged: YES YES NO NO
title: Mulliken charges:
elementType: O O C C C C C C C C C C C C C C C C C H H H H H H H H H H H H H H H H H H
charge: -0.208911 -0.264639 -0.313954 -0.619133 0.517265 0.515091 0.188708 -0.424794 -0.404107 -0.398385 -0.429994 -0.786056 -0.352332 -0.358576 0.312125 -0.230420 -0.229329 -0.244610 -0.538002 0.234942 0.240740 0.227905 0.238546 0.258349 0.240508 0.230094 0.253574 0.252996 0.238280 0.251331 0.241006 0.224135 0.222227 0.226363 0.221721 0.221249 0.246089
chargesum: 0.00000
title: Mulliken charges with hydrogens summed into heavy atoms:
elementType: O O C C C C C C C C C C C C C C C C C
charge: -0.208911 -0.264639 -0.079012 -0.150488 0.517265 0.515091 0.188708 -0.186248 -0.145759 -0.157877 -0.199901 -0.041205 -0.101001 -0.117571 0.312125 -0.006285 -0.007102 -0.018247 0.151057
polarizability: 2.16582886e+02 -1.81017980e+01 1.95657718e+02 -2.42122378e+01 -1.01611214e+01 1.42677688e+02
1716.lowfreq: -7.0595 -0.0004 -0.0003 0.0007 6.4306 9.4396 15.5362 24.1781 37.3231
frequency: 15.0077 24.0940 37.2803 42.5048 61.7633 71.3390 105.0087 113.2003 128.9889 157.9231 175.0988 232.0563 239.2001 252.6297 303.8209 337.0895 352.0409 394.1779 402.1101 414.0687 447.5415 488.7680 502.7431 537.2168 562.1001 581.1448 602.3818 617.9601 630.7217 703.2103 709.9194 734.2204 757.9062 790.6720 797.9707 818.2920 832.0161 851.8119 880.8511 916.0140 936.8645 941.2046 953.8634 963.9393 974.3854 987.3682 990.1865 992.4040 1002.6073 1012.5351 1026.4973 1038.2784 1081.4695 1109.0917 1111.8251 1150.1369 1155.6149 1170.9689 1178.9040 1180.9503 1187.1886 1193.4066 1217.3217 1231.1657 1257.3124 1286.9993 1310.2377 1326.8711 1327.9918 1364.7725 1381.8700 1383.1138 1419.6969 1436.2244 1439.8729 1442.3095 1454.3252 1466.7148 1467.0738 1472.6849 1483.2513 1498.3694 1581.4023 1591.7744 1613.6771 1619.1413 1625.4908 2959.9014 2979.1552 2992.4888 3009.3527 3047.6186 3067.2712 3069.7371 3109.9766 3120.3031 3120.9024 3124.7043 3125.8934 3127.6010 3132.1217 3143.2015 3160.4636 3160.9017 3167.0685
redmass: 3.8454 4.5625 3.9395 4.0351 4.2032 4.4101 2.5203 1.2159 3.8546 4.9212 3.6965 1.6751 2.9715 2.7147 4.0783 3.2612 2.5055 4.5089 2.8224 2.9515 3.6099 3.8797 3.5148 3.3182 2.7523 3.4152 4.4311 6.2477 6.5520 1.8723 2.8883 3.7511 1.9445 4.4729 4.3379 1.3286 1.6102 1.2508 2.2294 1.5953 1.7318 2.0444 1.6841 1.3617 1.3945 8.2126 5.8435 1.3293 2.7270 1.9414 2.1992 2.5045 1.6425 1.3518 1.2612 1.4593 1.3493 1.0656 1.3850 1.5467 1.1254 1.9726 2.3474 3.1538 1.8145 1.4681 1.3433 1.4605 1.2634 1.2454 7.6496 4.7866 3.1922 1.1721 2.1592 1.0719 1.0578 1.1071 1.0503 1.0763 2.3104 2.3778 7.1651 6.0342 6.1891 6.2987 7.9335 1.0329 1.0393 1.0817 1.0617 1.1039 1.0941 1.1009 1.0872 1.0858 1.1007 1.0946 1.0939 1.0900 1.0913 1.0960 1.0937 1.1015 1.0953
irintensity: 0.0216 0.1312 1.0163 5.2004 2.4641 0.6477 3.7265 0.9944 1.5125 1.8184 4.4903 1.0686 1.8824 0.5332 2.5007 1.2573 0.7358 0.5087 0.0669 0.0173 2.2071 6.9051 6.9778 27.3301 32.1032 5.7114 1.9763 0.2720 0.8383 50.4238 7.7002 3.8199 48.6187 4.1838 3.9720 13.2118 42.2481 0.0464 4.9525 1.9129 4.7815 10.2609 3.6798 0.4748 0.0115 42.9216 0.0754 0.2969 7.5954 1.7593 5.9560 1.2306 17.5806 8.5514 0.2542 37.2033 0.1650 1.3423 49.5455 54.8290 0.7449 2.9499 1.6610 182.4486 64.2143 18.2597 0.8289 13.5453 1.9133 64.2781 1.7531 8.7277 0.4859 10.6152 6.8990 18.1549 16.2279 10.2316 13.4121 60.3304 18.1179 117.6238 4.4196 1.1950 14.0795 43.8497 139.6654 68.4694 1.4325 14.5934 18.5666 47.5814 8.4056 19.5696 9.6296 2.2962 14.9769 24.1259 9.5731 9.0624 15.2854 46.4383 12.7071 22.0077 4.9184
temp: 298.150 k
press: 1.00000 atm
elementType: 8 8 6 6 6 6 6 6 6 6 6 6 6 6 6 6 6 6 6 1 1 1 1 1 1 1 1 1 1 1 1 1 1 1 1 1 1
symmnumber: 1
zpe: 791215.4 jmol-1
zpe.correction: 0.301358 hartree
zpe.thermalcorrener: 0.319690 hartree
zpe.thermalcorrenthalpy: 0.320635 hartree
zpe.thermalcorrgfe: 0.251727 hartree
zpe.sumelectzpe: -807.669673 hartree
zpe.sumelectthermal: -807.651341 hartree
zpe.sumelectthermalent: -807.650397 hartree
zpe.sumelectthermalfe: -807.719305 hartree
dipole: 1.6088 -1.0788 1.2327
dipole: 2.2960
quadrupole: -97.9250 -115.6033 -111.5121
quadrupole: -2.1412 -13.6658 10.5171
quadrupole: 10.4218 -7.2565 -3.1653 -2.1412 -13.6658 10.5171
hfenergy: -807.9710311 hartree
pointgroup: C01 [X(C17H18O2)]
dipole: -0.6210232 0.4446432 0.482314 debye
polarizability: 213.7593855|-19.7608828|197.0817848|25.6776824|9.7244574|144.0771211 unknown
InChI: InChI=1S/C17H18O2/c1-13(18)17(12-14-6-4-3-5-7-14)15-8-10-16(19-2)11-9-15/h3-11,17H,12H2,1-2H3
charge 0 multiplicity 1
37 atoms
O  0.196136 -3.544022 -1.232617
O  -4.028096 1.907895 0.402917
C  0.587794 -1.567047 0.163713
C  1.638079 -1.118404 -0.903248
C  -0.648021 -0.656969 0.207981
C  2.382084 0.140495 -0.486758
C  0.116467 -3.016109 -0.09095
C  -0.900334 0.187374 1.320853
C  -1.563838 -0.63384 -0.872302
C  1.897457 1.430608 -0.825117
C  3.574049 0.048072 0.279135
C  -0.454098 -3.765521 1.10531
C  -2.027571 1.028441 1.356039
C  -2.701452 0.20344 -0.854771
C  -2.934952 1.037926 0.267237
C  2.582725 2.594662 -0.409814
C  4.262942 1.20889 0.697514
C  3.768325 2.488727 0.353975
C  -4.997178 1.954321 -0.694668
H  1.062333 -1.538445 1.16504
H  1.118741 -0.974086 -1.866872
H  2.349887 -1.951248 -1.055001
H  -0.197712 0.196772 2.16255
H  -1.394182 -1.283973 -1.739249
H  0.977225 1.519986 -1.414619
H  3.970919 -0.94226 0.538033
H  -0.979656 -4.675236 0.775804
H  -1.138072 -3.120432 1.685168
H  0.372095 -4.05921 1.782838
H  -2.222962 1.687008 2.207748
H  -3.389725 0.19331 -1.705254
H  2.193661 3.582334 -0.682765
H  5.185604 1.116562 1.28216
H  4.302455 3.39092 0.673043
H  -5.475996 0.96815 -0.852052
H  -4.523162 2.291045 -1.637304
H  -5.753778 2.687161 -0.378298
