program: Gaussian 09
title: 000229366
version: EM64L-G09RevD.01
frameworkgroup: C1[X(C16H24N2O4)]
method: RPBEPBE
basis: SDD
operation: Freq
keyword: #p
keyword: freq=noraman
keyword: PBEPBE/SDD
title: #p freq=noraman PBEPBE/SDD
converged: NO YES NO NO
title: Mulliken charges:
elementType: O O O O N N C C C C C C C C C C C C C C C C H H H H H H H H H H H H H H H H H H H H H H H H
charge: -0.248377 -0.239577 -0.448911 -0.432633 -0.111329 -0.244775 -0.462899 -0.495569 -0.342014 -0.338739 -0.329133 -0.332688 0.344002 0.392002 -0.324797 -0.319942 -0.325328 -0.322700 0.085984 0.090208 -0.515831 -0.634179 0.231584 0.222265 0.237838 0.216663 0.196059 0.227482 0.187961 0.209969 0.215054 0.245929 0.211985 0.224208 0.195036 0.211597 0.210764 0.192827 0.207325 0.225027 0.223933 0.200398 0.293654 0.220570 0.351655 0.397443
chargesum: 0.00000
title: Mulliken charges with hydrogens summed into heavy atoms:
elementType: O O O O N N C C C C C C C C C C C C C C C C
charge: -0.248377 -0.239577 -0.097256 -0.035190 -0.111329 -0.244775 -0.009051 -0.041069 0.081527 0.059191 0.131850 0.103504 0.344002 0.392002 0.081837 0.083649 0.107024 0.101631 0.085984 0.090208 -0.222176 -0.413609
polarizability: 2.61993823e+02 -5.14605815e+00 1.90600937e+02 -1.51034391e+00 1.27573713e+01 1.52203749e+02
1716.lowfreq: -20.9808 -0.0003 0.0006 0.0007 2.2267 10.5248 24.4160 35.6596 43.2026
frequency: 16.4812 34.9795 42.9151 58.4339 67.5199 71.0191 118.0015 145.2361 181.0787 197.2908 204.1055 231.5976 237.3770 249.4855 266.1539 278.8609 299.3672 306.5844 311.9017 346.2512 374.1165 380.6227 399.4515 425.1228 434.4610 440.0806 461.7053 466.4907 472.3546 475.6291 545.5918 578.0580 598.4392 622.2292 639.5574 706.9630 728.4606 742.8380 771.0531 775.2389 806.0493 807.2958 830.5921 835.9689 841.4653 842.6692 895.0055 898.2773 921.5694 982.0810 988.9826 992.6425 1000.3321 1025.3961 1028.2292 1043.4870 1053.1156 1061.9844 1067.9946 1083.4849 1092.2145 1105.1798 1108.1765 1114.4745 1126.8139 1133.4004 1142.6517 1147.1729 1160.8564 1189.4634 1192.9606 1201.5035 1216.2644 1223.4176 1236.9754 1261.2732 1267.7779 1278.0779 1286.0682 1292.1284 1293.0637 1304.6291 1321.4269 1330.1077 1338.0700 1340.2708 1355.0270 1356.4223 1364.1346 1368.6452 1372.5191 1373.4604 1383.2776 1415.2296 1442.9727 1447.8736 1448.3508 1448.5346 1451.2459 1455.3750 1457.4922 1458.7430 1464.3978 1471.2559 1488.9550 1532.7763 1601.6756 1641.7913 2590.8384 2858.1012 2868.4377 2901.9927 2918.9482 2925.3486 2934.2177 2952.8560 2954.8121 2956.6895 2962.1014 2990.3287 2990.4224 3023.4697 3037.2918 3039.2257 3053.5101 3078.2743 3081.7140 3087.0165 3090.5414 3091.5922 3162.9079 3585.7466
redmass: 4.3324 4.9837 3.6848 4.6085 3.1649 4.8823 5.6188 4.1218 5.5409 3.5347 4.3854 2.2973 4.3411 2.1535 2.7215 2.6444 1.3256 1.9074 2.2013 2.3717 6.4207 4.0451 2.2016 2.3621 4.4020 3.7782 3.8919 3.0215 3.0395 6.4551 3.5780 4.0198 2.1759 2.2910 4.5295 4.6181 4.1609 5.9130 3.8539 3.3982 3.7933 3.4447 1.5685 2.6294 1.6002 1.8117 2.2759 2.2893 1.4137 2.0302 2.0008 2.5900 2.5796 2.1529 2.1496 1.4843 2.0683 3.6990 2.0051 3.5768 2.4027 2.2469 2.4086 2.2261 1.9316 2.7469 2.4597 2.6540 1.6765 1.0677 1.1077 1.5832 1.1999 1.2232 1.3167 1.3691 1.3487 1.3841 1.4801 1.3545 1.2986 2.9383 1.4135 1.3170 1.2531 1.2622 1.4075 1.4922 2.2325 1.2706 1.7635 1.4529 1.6090 2.9208 1.0823 1.0869 1.0813 1.0827 1.0958 1.0935 1.0943 1.0965 1.1205 1.1092 2.7097 1.8364 4.6509 5.1689 1.0696 1.0703 1.0695 1.0675 1.0653 1.0663 1.0665 1.0664 1.0670 1.0665 1.0669 1.0973 1.0901 1.0893 1.0944 1.0894 1.0942 1.0962 1.0978 1.0959 1.0908 1.0973 1.0913 1.0660
irintensity: 0.4785 0.1206 0.2376 0.5399 0.5236 0.2778 5.6400 8.9668 1.6689 5.5756 2.4593 1.8206 1.9249 1.0913 3.2789 3.7800 93.7948 20.1515 22.2280 18.1842 0.2660 6.1950 0.9612 18.9525 8.3890 8.4691 9.8519 6.2475 4.3037 4.6097 13.3497 2.9105 7.7369 9.6374 1.3237 23.1964 9.7487 0.5378 3.5219 17.1351 23.7522 23.0478 34.6532 22.5660 1.1328 13.2676 4.6374 33.9277 28.9546 26.4932 4.8880 26.3271 24.0966 16.4069 11.3986 37.5938 27.2804 35.5327 31.7802 41.9031 60.1948 2.2608 18.7912 8.0329 183.1792 63.2033 8.0535 4.5773 48.2201 1.6061 2.4255 3.1800 8.9829 5.7877 24.0126 37.3824 5.3748 6.3063 28.5390 6.7383 1.6436 32.2193 9.0538 9.7841 12.8469 17.8142 12.5060 7.2633 24.6390 4.3438 52.3113 13.8923 19.6171 80.8478 2.2772 1.5181 5.3722 1.2487 12.7962 19.1205 13.1527 4.8383 20.9115 36.2490 107.9109 42.2332 6.5964 54.2994 1420.6584 61.3556 107.4085 56.1496 9.9873 52.9829 52.8293 30.6697 43.1706 95.3016 68.7539 22.7469 12.8735 48.2861 33.9258 29.5795 19.4973 45.0725 40.0866 34.1381 20.9226 27.2662 1.8828 24.4581
temp: 298.150 k
press: 1.00000 atm
elementType: 8 8 8 8 7 7 6 6 6 6 6 6 6 6 6 6 6 6 6 6 6 6 1 1 1 1 1 1 1 1 1 1 1 1 1 1 1 1 1 1 1 1 1 1 1 1
symmnumber: 1
zpe: 1012942.0 jmol-1
zpe.correction: 0.385809 hartree
zpe.thermalcorrener: 0.406366 hartree
zpe.thermalcorrenthalpy: 0.407310 hartree
zpe.thermalcorrgfe: 0.335492 hartree
zpe.sumelectzpe: -1032.742649 hartree
zpe.sumelectthermal: -1032.722092 hartree
zpe.sumelectthermalent: -1032.721148 hartree
zpe.sumelectthermalfe: -1032.792966 hartree
dipole: 3.9831 3.9212 0.6920
dipole: 5.6320
quadrupole: -135.5572 -129.8132 -129.7211
quadrupole: 3.2122 0.6080 3.2240
quadrupole: -3.8601 1.8840 1.9761 3.2122 0.6080 3.2240
hfenergy: -1033.1284581 hartree
pointgroup: C01 [X(C16H24N2O4)]
dipole: 1.5648794 1.4727016 0.5404267 debye
polarizability: 262.0114047|-4.9924631|185.2238445|-1.6912904|18.4240194|157.5632603 unknown
InChI: InChI=1S/C16H24N2O4/c19-15-10-14(12-18-3-7-22-8-4-18)16(20)9-13(15)11-17-1-5-21-6-2-17/h9-10,19-20H,1-8,11-12H2
charge 0 multiplicity 1
46 atoms
O  -5.358852 -2.347903 0.022491
O  5.475103 -2.033255 0.430046
O  -1.526313 3.148512 1.561765
O  1.393539 -0.616125 -1.451002
N  -3.559362 -0.083596 -0.252625
N  3.55652 0.066427 -0.166461
C  -2.981783 1.246457 0.053575
C  2.918438 1.42191 -0.058426
C  -3.435375 -1.032815 0.883928
C  -4.970548 -0.002976 -0.704673
C  3.497133 -0.700665 1.117232
C  4.959305 0.133468 -0.669986
C  -1.457172 1.245071 0.068974
C  1.403766 1.324398 0.053071
C  -3.955991 -2.417459 0.469355
C  -5.470897 -1.40211 -1.100733
C  4.083226 -2.105372 0.907692
C  5.524345 -1.287405 -0.836632
C  -0.749245 2.218913 0.823073
C  0.699898 0.334232 -0.697626
C  -0.713633 0.310877 -0.681994
C  0.661874 2.252122 0.818744
H  -3.354658 1.657846 1.021267
H  -3.32765 1.949721 -0.731224
H  3.188573 1.962629 -0.988933
H  3.342578 1.99845 0.794388
H  -4.012521 -0.673329 1.773442
H  -2.37145 -1.107049 1.174503
H  -5.638993 0.409465 0.093555
H  -5.030415 0.669948 -1.581677
H  4.072052 -0.168855 1.908973
H  2.441894 -0.769491 1.43703
H  5.601388 0.709487 0.035407
H  4.961982 0.652745 -1.646671
H  -3.322281 -2.822587 -0.349048
H  -3.953957 -3.117064 1.321615
H  -6.541541 -1.383059 -1.364352
H  -4.878284 -1.775288 -1.964022
H  3.46113 -2.66861 0.178986
H  4.125151 -2.659978 1.858792
H  6.588354 -1.255401 -1.121943
H  4.948866 -1.831236 -1.617186
H  -1.250035 -0.446513 -1.260963
H  1.195849 3.015432 1.403433
H  -0.939218 3.761955 2.068341
H  2.391805 -0.541325 -1.140996
