program: Gaussian 09
title: 000229355
version: EM64L-G09RevD.01
frameworkgroup: C1[X(C9H9ClO)]
method: RPBEPBE
basis: SDD
operation: Freq
keyword: #p
keyword: freq=noraman
keyword: PBEPBE/SDD
title: #p freq=noraman PBEPBE/SDD
converged: YES YES NO NO
title: Mulliken charges:
elementType: Cl O C C C C C C C C C H H H H H H H H H
charge: -0.070140 -0.200488 -0.635936 0.561335 -0.313418 -0.367350 0.226740 -0.223410 -0.230016 -0.227768 -0.757886 0.251881 0.254273 0.251377 0.258145 0.235284 0.237927 0.253892 0.250923 0.244635
chargesum: 0.00000
title: Mulliken charges with hydrogens summed into heavy atoms:
elementType: Cl O C C C C C C C C C
charge: -0.070140 -0.200488 -0.129782 0.561335 -0.313418 -0.115973 0.226740 0.034735 0.005269 0.010159 -0.008436
polarizability: 1.27215978e+02 -2.82006035e+00 1.18503657e+02 1.36304460e+01 2.15976419e+00 6.56504423e+01
1716.lowfreq: -13.0329 -7.8025 0.0021 0.0027 0.0034 4.7975 25.0297 48.0684 85.0725
frequency: 22.9240 48.0164 85.0413 121.3803 152.0170 219.1080 260.6759 344.8861 371.7423 413.8025 441.8190 456.9656 500.6978 537.6515 607.6112 663.1287 719.5375 755.7427 780.2520 825.0001 868.4456 871.3258 951.4984 989.2079 995.3861 1008.5127 1024.0100 1040.0295 1121.5643 1157.1183 1174.6553 1207.4761 1223.9438 1278.5432 1286.6226 1372.0504 1374.5097 1425.2488 1443.8026 1444.5692 1453.9569 1464.5974 1573.2202 1602.6419 1636.7450 2986.5588 3002.4764 3070.5636 3079.0912 3125.1209 3129.2816 3144.2568 3160.8643 3175.8161
redmass: 3.7526 4.9699 4.3596 1.1142 4.4755 6.3790 4.2399 4.5023 3.5542 3.1990 3.3405 4.0883 3.0467 3.6240 4.1814 5.8615 4.5834 1.4838 2.2648 3.4217 1.7002 1.4513 1.3769 1.3645 2.0555 2.1236 2.9659 2.0776 1.6989 1.3415 1.0874 2.1441 2.8314 1.3365 1.5136 2.5046 1.8846 2.1830 1.0727 1.0922 1.0999 2.3043 6.1096 7.1671 7.9240 1.0370 1.0607 1.0958 1.0997 1.1009 1.0877 1.0894 1.0948 1.0999
irintensity: 6.1563 1.7747 0.0799 0.1110 0.3814 1.5106 5.1569 3.9155 2.3413 3.0542 4.4545 10.8924 1.7516 14.4669 3.6909 16.9829 3.2264 63.6813 19.2995 1.7419 3.6693 0.4229 0.4108 0.6952 7.6091 7.5385 48.0500 4.4118 4.8100 19.0765 3.6079 1.2547 125.9533 5.7480 0.5342 18.6446 37.6590 20.8191 37.2430 7.8659 45.3226 30.0641 7.8269 19.7287 162.9082 1.7343 11.0834 7.9295 5.5802 13.9715 2.7089 6.7394 12.8742 11.7342
temp: 298.150 k
press: 1.00000 atm
elementType: 17 8 6 6 6 6 6 6 6 6 6 1 1 1 1 1 1 1 1 1
symmnumber: 1
zpe: 401895.7 jmol-1
zpe.correction: 0.153074 hartree
zpe.thermalcorrener: 0.163844 hartree
zpe.thermalcorrenthalpy: 0.164788 hartree
zpe.thermalcorrgfe: 0.114645 hartree
zpe.sumelectzpe: -882.840142 hartree
zpe.sumelectthermal: -882.829372 hartree
zpe.sumelectthermalent: -882.828428 hartree
zpe.sumelectthermalfe: -882.878571 hartree
dipole: 3.0727 -0.3557 0.9044
dipole: 3.2227
quadrupole: -78.3120 -69.8524 -71.3748
quadrupole: -8.1535 0.8669 0.3638
quadrupole: -5.1323 3.3274 1.8049 -8.1535 0.8669 0.3638
hfenergy: -882.9932159 hartree
pointgroup: C01 [X(C9H9Cl1O1)]
dipole: -1.1109349 0.371753 -0.4850154 debye
dipolederiv: -0.2850287 -0.2124947 -0.1340165 -0.21361 -0.5425447 -0.2186389 -0.1315794 -0.2097702 -0.2006026 -0.7640413 0.2818941 0.0264658 0.4189274 -0.7141492 0.1425282 0.1262243 0.0809109 -0.4155948 -0.4605651 0.1467024 0.1283241 0.1819337 -0.0098357 -0.006009 0.307811 -0.0731947 -0.1053113 0.2815755 -0.1710426 0.0345801 -0.1632898 -0.182782 -0.0823654 0.195858 -0.1622937 -0.0591309 0.1995387 0.3699669 0.2366515 0.379809 0.7231853 0.3451986 0.1967864 0.3544766 0.1281963 -0.1371728 0.0389987 0.0635358 -0.0721856 0.0657393 0.001425 0.0093426 0.0599497 -0.1089024 1.0358586 -0.3906653 -0.310198 -0.4452201 0.8008767 -0.3196225 -0.6430374 -0.1857326 0.5921599 -0.1177104 -0.1171701 -0.0401922 -0.1161058 -0.102923 -0.0704522 -0.0360716 -0.0595976 -0.1265097 -0.030492 0.0472184 0.0610652 0.0543096 0.0426003 0.0648334 0.0693632 0.0585789 -0.0969338 0.0053276 -0.0425843 0.1077322 0.0018769 0.0060274 0.0218535 0.0959193 0.0006676 -0.0946266 -0.0582997 0.0045833 0.0417867 -0.0233954 -0.2428692 0.2486279 0.14627 0.2254752 -0.2596593 0.0549745 -0.013954 -0.0138463 -0.0894042 0.0529702 -0.0916984 -0.0384025 -0.0276279 0.0676969 0.0170736 -0.003807 0.0070009 -0.0066377 -0.0241933 0.1107486 -0.010314 0.0589304 0.0381799 0.0759585 0.0701939 -0.0366717 0.0570055 -0.0512762 -0.0023445 -0.0341805 0.0060361 0.1212086 0.0938919 0.041154 -0.029251 0.0617669 -0.0280106 -0.0012133 -0.0309934 -0.0068815 0.1472083 0.0466809 -0.0658537 -0.0713158 -0.0776934 -0.0220063 -0.07169 -0.0794421 -0.0664642 0.1086664 -0.0443419 0.0285146 -0.110812 0.0298941 0.0748687 0.0021496 -0.1142504 0.0006387 0.0989163 -0.0677923 0.0105898 0.1073763 0.0555601 0.092246 -0.0066391 0.090923 0.0073985 0.061659 -0.0010729 -0.0258106 -0.1043078 -0.0348042 0.093406 -0.0179109 -0.0989998 0.0213892 0.0510017 0.1556372 0.0035661 0.0360927 0.0012632 -0.0313297 -0.0487807 -0.021227 -0.0828893 0.0523778 unknown
polarizability: 121.2978715|-5.8029785|116.9969299|22.3191941|8.0225285|73.0752756 unknown
InChI: InChI=1S/C9H9ClO/c1-7(11)6-8-4-2-3-5-9(8)10/h2-5H,6H2,1H3
charge 0 multiplicity 1
20 atoms
Cl 0.336377 2.340683 1.384136
O  3.245549 -1.941086 0.590993
C  1.329836 -0.699746 1.445281
C  0.013939 -0.39177 0.751402
C  -0.54159 0.905981 0.645006
C  -0.725394 -1.448848 0.151203
C  2.511914 -0.925969 0.472577
C  -1.760305 1.168942 -0.010721
C  -1.946344 -1.216401 -0.515731
C  -2.467221 0.095775 -0.59736
C  2.74712 0.127669 -0.598236
H  1.610199 0.136904 2.113735
H  1.241965 -1.6119 2.059901
H  -0.323975 -2.466931 0.219856
H  -2.147887 2.190585 -0.059394
H  -2.490734 -2.05316 -0.965687
H  -3.415645 0.288734 -1.109352
H  3.704322 -0.059055 -1.108511
H  1.928353 0.096531 -1.342035
H  2.736923 1.142463 -0.160064
