program: Gaussian 09
title: 000229353
version: EM64L-G09RevD.01
frameworkgroup: C1[X(C12H16O)]
method: RPBEPBE
basis: SDD
operation: Freq
keyword: #pfreq=noraman
keyword: PBEPBE/SDD
title: #p freq=noraman PBEPBE/SDD
converged: YES YES NO NO
title: Mulliken charges:
elementType: O C C C C C C C C C C C C H H H H H H H H H H H H H H H H
charge: -0.207944 -0.301382 -0.386898 -0.352549 0.486974 0.187580 -0.695474 -0.387075 -0.446655 -0.789416 -0.233644 -0.221906 -0.245299 0.205414 0.221775 0.203799 0.184977 0.220187 0.215415 0.209102 0.214062 0.259314 0.233713 0.237910 0.254112 0.251163 0.226738 0.226336 0.229672
chargesum: 0.00000
title: Mulliken charges with hydrogens summed into heavy atoms:
elementType: O C C C C C C C C C C C C
charge: -0.207944 -0.095968 0.038676 0.052615 0.486974 0.187580 -0.056895 -0.127761 -0.212943 -0.046231 -0.006907 0.004430 -0.015628
polarizability: 1.45271934e+02 1.69170651e+01 1.11750783e+02 1.49746385e+00 1.76520847e+00 1.23036299e+02
1716.lowfreq: -10.7607 -0.0009 -0.0008 -0.0007 1.4813 11.0680 29.3541 37.2625 57.3925
frequency: 29.2767 37.0368 57.3328 71.1150 95.4734 101.2298 118.0496 185.7957 228.8255 240.7140 284.8982 308.8568 322.2356 403.6249 452.5262 471.7216 549.5854 583.1298 616.5876 622.7651 705.8933 725.6318 762.3194 773.6495 850.6699 855.4144 879.3778 901.3829 926.9457 950.2388 978.0838 989.6245 996.4971 999.8220 1023.7343 1034.9824 1060.8957 1074.5125 1109.5819 1117.3453 1169.6480 1172.6717 1188.9439 1192.3449 1216.9581 1250.2621 1278.7221 1293.5123 1317.1408 1334.6967 1354.3140 1365.1561 1381.8019 1388.9254 1440.3794 1442.1082 1453.5169 1461.1478 1473.3742 1476.7779 1479.2642 1486.6428 1590.6727 1607.3120 1630.6696 2966.0888 2973.8197 2976.4469 2980.6387 2987.5189 3019.0862 3052.0540 3064.4746 3072.1301 3073.3954 3115.6697 3121.0637 3123.1788 3134.9971 3145.5677 3163.3735
redmass: 4.1442 3.6562 3.6245 1.6040 2.0883 1.4192 3.2868 2.9829 1.2263 2.7786 2.9530 4.4882 3.7962 2.8216 3.1773 3.8082 2.8490 3.6613 6.0381 3.0521 1.7622 1.3936 1.7593 2.2107 3.0418 1.2497 1.3738 1.7572 1.5193 1.8852 1.3952 5.9289 1.3280 1.9359 2.3265 2.0087 2.0651 1.7562 2.1362 1.9081 1.7109 1.2003 1.1303 2.5405 1.4217 1.6118 1.2863 1.1703 1.4464 1.2621 1.5666 1.2483 7.4689 1.2133 2.0781 1.0843 1.0610 1.0837 1.0606 1.0544 2.1470 1.0819 6.0687 6.0259 7.9345 1.0616 1.0367 1.0620 1.0572 1.0632 1.0953 1.1012 1.0949 1.1009 1.0994 1.0870 1.1003 1.0866 1.0914 1.0961 1.1015
irintensity: 5.4050 0.4074 0.0538 0.0898 0.8466 0.7236 1.8676 0.4377 0.5191 2.1409 0.1795 2.5419 1.3510 0.0074 0.1950 1.0782 28.3451 2.2423 0.2187 3.0807 49.6304 17.7539 27.9833 9.8385 0.0869 0.1080 0.6599 9.2685 3.8588 5.9534 0.0246 0.1222 0.1793 3.8942 5.2191 1.8247 3.7665 10.6608 2.6746 10.6019 45.0688 14.8801 0.0529 1.4134 3.1138 65.2293 3.2399 0.6859 17.4536 1.7972 1.3654 64.9584 0.2699 10.9566 7.2509 21.8107 14.5128 3.3032 2.3449 14.9181 16.3438 14.4691 4.6866 20.3227 100.6561 25.5689 35.4923 5.2565 18.2336 31.3186 5.3054 15.2872 10.6511 87.1434 45.3191 8.1442 14.4302 0.4791 10.8659 33.3163 24.4446
temp: 298.150 k
press: 1.00000 atm
elementType: 8 6 6 6 6 6 6 6 6 6 6 6 6 1 1 1 1 1 1 1 1 1 1 1 1 1 1 1 1
symmnumber: 1
zpe: 645468.2 jmol-1
zpe.correction: 0.245846 hartree
zpe.thermalcorrener: 0.259800 hartree
zpe.thermalcorrenthalpy: 0.260745 hartree
zpe.thermalcorrgfe: 0.203324 hartree
zpe.sumelectzpe: -541.120294 hartree
zpe.sumelectthermal: -541.106340 hartree
zpe.sumelectthermalent: -541.105396 hartree
zpe.sumelectthermalfe: -541.162816 hartree
dipole: -1.2364 -0.8832 -2.4813
dipole: 2.9095
quadrupole: -76.6113 -82.1576 -75.8200
quadrupole: -0.4397 -4.3616 -6.0288
quadrupole: 1.5850 -3.9613 2.3763 -0.4397 -4.3616 -6.0288
hfenergy: -541.3661402 hartree
pointgroup: C01 [X(C12H16O1)]
dipole: 0.4778939 -0.032418 1.0396707 debye
polarizability: 151.3787265|-3.2426733|104.9829754|5.0779724|1.1452343|123.6973137 unknown
InChI: InChI=1S/C12H16O/c1-3-7-12(10(2)13)11-8-5-4-6-9-11/h4-6,8-9,12H,3,7H2,1-2H3
charge 0 multiplicity 1
29 atoms
O  -2.141979 1.479393 -1.6187
C  -1.233296 0.270814 0.312853
C  -1.980162 -0.991274 -0.196438
C  -1.679202 -2.255751 0.637123
C  0.294129 0.149258 0.192045
C  -1.68136 1.540921 -0.447986
C  -2.44553 -3.492203 0.11944
C  0.905569 0.047938 -1.085667
C  1.117194 0.12689 1.345977
C  -1.523194 2.865156 0.285927
C  2.306749 -0.080606 -1.202292
C  2.520273 -0.003619 1.230958
C  3.120018 -0.108017 -0.044782
H  -1.471781 0.423271 1.385762
H  -1.717578 -1.163776 -1.256926
H  -3.069787 -0.788404 -0.183475
H  -1.948243 -2.071246 1.698111
H  -0.590853 -2.45957 0.621869
H  -2.221081 -4.389099 0.725324
H  -3.538988 -3.326429 0.151173
H  -2.171645 -3.714996 -0.928897
H  0.281982 0.07896 -1.987112
H  0.656926 0.202064 2.339121
H  -2.281048 2.935524 1.090995
H  -1.661746 3.709494 -0.406914
H  -0.530514 2.929281 0.767516
H  2.765317 -0.155774 -2.194808
H  3.141946 -0.025705 2.133264
H  4.207283 -0.207997 -0.13636
