program: Gaussian 09
title: 000229344
version: EM64L-G09RevD.01
frameworkgroup: C1[X(C8H9N3)]
method: RPBEPBE
basis: SDD
operation: Freq
keyword: #p
keyword: freq=noraman
keyword: PBEPBE/SDD
title: #p freq=noraman PBEPBE/SDD
converged: YES YES NO NO
title: Mulliken charges:
elementType: N N N C C C C C C C C H H H H H H H H H
charge: -0.393890 -0.703362 -0.015831 0.468569 -0.333845 -0.402244 0.502065 -0.424119 -0.400003 -0.460534 -0.121316 0.228435 0.214596 0.214098 0.213851 0.289329 0.261372 0.262404 0.300924 0.299500
chargesum: 0.00000
title: Mulliken charges with hydrogens summed into heavy atoms:
elementType: N N N C C C C C C C C
charge: -0.104561 -0.102938 -0.015831 0.468569 -0.105409 -0.187647 0.502065 -0.210021 -0.186152 0.063243 -0.121316
polarizability: 1.53130556e+02 -4.16649384e+00 1.01022085e+02 4.91365532e+00 5.74808610e+00 6.23806172e+01
1716.lowfreq: -10.3446 0.0004 0.0006 0.0009 4.6934 8.1589 43.0989 56.3011 126.6674
frequency: 43.0551 56.2787 126.6639 203.8759 214.5122 271.7082 315.2920 316.7479 338.4818 371.8204 394.2653 401.9481 411.5161 497.3210 513.8237 599.1639 644.9176 711.1034 738.2255 795.2686 809.7693 826.1285 857.0471 911.8280 927.2090 976.4470 994.3434 1018.7604 1101.0044 1139.6423 1193.8862 1253.5217 1271.9913 1314.2033 1324.1723 1347.9413 1381.6172 1428.1959 1446.1363 1481.8908 1526.1421 1590.3614 1635.8276 1656.4133 2177.1692 2994.0084 3054.9612 3109.2343 3120.5395 3134.3646 3151.4602 3564.1210 3576.4542 3716.8783
redmass: 5.8315 5.5451 5.1336 3.5664 4.4197 1.1958 1.9339 1.2820 3.9472 2.4469 2.0268 3.9628 2.4427 3.8778 2.4102 4.8646 6.1404 3.3504 3.8269 1.2759 1.8118 5.2979 6.3829 1.4094 1.3515 2.1787 2.4637 1.4411 3.6905 1.2582 1.0954 1.1407 2.0378 2.7064 1.4562 1.2690 4.3694 2.1314 1.2336 1.6989 3.2094 5.6446 1.2335 4.8075 12.3345 1.0610 1.0998 1.0866 1.0879 1.0962 1.0950 1.0768 1.0448 1.1040
irintensity: 2.5539 3.1396 5.4992 7.5440 1.7187 299.5249 21.2950 33.3130 9.8275 8.7311 97.3174 10.5077 15.0384 25.1915 13.1994 19.5378 4.4472 0.5217 12.5771 0.6471 102.6633 4.7893 24.0227 0.1196 0.0635 0.5364 0.4576 2.1467 29.4518 29.1749 1.7433 12.6223 141.9743 18.4254 4.6040 10.1611 27.6012 15.0978 24.3520 9.1483 429.3910 0.2505 118.3364 44.4605 1.2270 32.5804 5.0413 20.2544 28.3284 32.5612 11.9367 17.4061 64.6566 18.8262
temp: 298.150 k
press: 1.00000 atm
elementType: 7 7 7 6 6 6 6 6 6 6 6 1 1 1 1 1 1 1 1 1
symmnumber: 1
zpe: 412590.0 jmol-1
zpe.correction: 0.157147 hartree
zpe.thermalcorrener: 0.167925 hartree
zpe.thermalcorrenthalpy: 0.168869 hartree
zpe.thermalcorrgfe: 0.120462 hartree
zpe.sumelectzpe: -473.689942 hartree
zpe.sumelectthermal: -473.679165 hartree
zpe.sumelectthermalent: -473.678221 hartree
zpe.sumelectthermalfe: -473.726628 hartree
dipole: 2.5544 2.1947 -1.7059
dipole: 3.7752
quadrupole: -55.4022 -59.9797 -69.7647
quadrupole: -13.6024 10.9675 7.7542
quadrupole: 6.3133 1.7358 -8.0492 -13.6024 10.9675 7.7542
hfenergy: -473.8470897 hartree
pointgroup: C01 [X(C8H9N3)]
dipole: -0.87499 -0.3792345 -1.1386806 debye
dipolederiv: -1.4183292 -0.0880193 0.0351235 -0.1182706 -0.1810829 -0.0599382 0.4390905 -0.0331062 -0.6633149 -1.6406083 0.1388117 0.1142619 0.2052981 -0.148954 0.1756987 0.1471675 0.1870785 -0.7234715 -0.2612801 -0.019094 -0.0127729 0.0572774 -0.2048254 0.0232295 -0.227714 -0.0657942 -0.2567342 1.3350841 -0.0709566 -0.1434283 -0.2767266 -0.2567909 -0.0590627 -0.3304521 -0.0750698 0.0789862 -0.0755212 -0.2169935 -0.0753759 0.3051524 0.0754374 0.0730714 0.0747421 0.1454544 -0.138545 -0.1206817 0.2422598 0.0444313 -0.2025647 0.1148173 0.13302 -0.0648831 0.0622287 -0.1527869 1.5996674 -0.1640809 -0.2296669 -0.198678 -0.1733447 -0.0693742 -0.2724871 -0.0810308 0.1259164 -0.2683373 0.250515 0.0723815 -0.3268064 0.0987734 0.1403473 -0.1120954 0.0769293 -0.1782066 -0.2049705 -0.1615255 -0.0660595 0.3974346 0.0955404 0.0488982 0.1379048 0.1357748 -0.183186 0.6912235 0.178736 0.137975 0.562767 0.4744225 0.0654255 0.255814 0.0789312 0.4559315 -0.1685765 -0.0213341 0.0239585 -0.2229501 -0.1496195 -0.0016768 -0.0006093 0.0004891 -0.0447664 -0.0040962 -0.1085186 -0.010006 -0.128991 -0.00644 -0.0562583 -0.0192801 -0.052842 0.1364137 0.0408928 0.0899093 0.0513503 0.0749548 -0.0597399 -0.0848721 0.0432787 -0.0913014 0.120063 0.0201225 0.0781135 0.0425723 0.0797338 -0.0622666 -0.0852085 0.0497914 -0.0887987 0.128752 -0.0442162 -0.1237109 -0.0146298 -0.1100713 -0.0297969 -0.0500219 -0.0098439 -0.0440445 0.1518244 0.0712499 -0.0348276 0.0048728 -0.0167243 0.0925733 -0.0049413 -0.124449 0.0479772 0.3498027 0.1355505 0.0822376 -0.0774027 -0.0652376 -0.0642302 0.0370774 -0.0664412 0.0034322 0.0385938 -0.0970725 -0.0091371 0.0492943 0.039292 0.1121637 -0.0669008 0.0045254 -0.0437243 0.0367078 0.1988992 -0.0325833 0.023186 -0.0538339 0.1404521 -0.0797836 0.0277404 -0.0853852 0.3567111 0.2109996 -0.0098016 0.0299346 -0.0010556 0.1329109 -0.0787297 0.0482005 -0.0771982 0.361309 unknown
polarizability: 153.0588938|6.1596638|92.4675783|-1.9750118|17.2036729|71.0067868 unknown
InChI: InChI=1S/C8H9N3/c9-5-6-11-8-3-1-7(10)2-4-8/h1-4,11H,6,10H2
charge 0 multiplicity 1
20 atoms
N  1.497948 -0.456691 -0.658627
N  -4.061858 0.159692 0.415337
N  3.17295 0.969624 2.125798
C  0.122333 -0.279719 -0.350419
C  -0.403131 0.943392 0.143721
C  -0.781499 -1.354404 -0.571648
C  -2.689934 0.01627 0.167267
C  -1.784621 1.089327 0.389668
C  -2.157144 -1.214066 -0.314821
C  2.493439 0.579929 -0.450674
C  2.873231 0.820047 0.979824
H  0.256553 1.789275 0.364277
H  -0.403237 -2.309539 -0.958368
H  -2.160572 2.045696 0.773834
H  -2.827681 -2.063498 -0.495138
H  1.839156 -1.417211 -0.691236
H  2.137987 1.53801 -0.87552
H  3.416334 0.314919 -0.998267
H  -4.43552 1.029894 0.779761
H  -4.698135 -0.619948 0.285329
