program: Gaussian 09
title: 000229331
version: EM64L-G09RevD.01
frameworkgroup: C1[X(C13H9ClN2O3)]
method: RPBEPBE
basis: SDD
operation: Freq
keyword: #p
keyword: freq=noraman
keyword: PBEPBE/SDD
title: #p freq=noraman PBEPBE/SDD
converged: NO NO NO NO
title: Mulliken charges:
elementType: Cl O O O N N C C C C C C C C C C C C C H H H H H H H H H
charge: -0.052428 -0.259376 -0.195290 -0.206057 -0.476135 0.021594 0.302790 0.510359 0.139732 -0.476286 0.368579 -0.349232 -0.357933 -0.184408 -0.324164 -0.438905 -0.198232 -0.182222 -0.121372 0.268686 0.320284 0.287559 0.292837 0.248602 0.315166 0.230011 0.257593 0.258247
chargesum: 0.00000
title: Mulliken charges with hydrogens summed into heavy atoms:
elementType: Cl O O O N N C C C C C C C C C C C C C
charge: -0.052428 -0.259376 -0.195290 -0.206057 -0.155850 0.021594 0.302790 0.510359 0.139732 -0.207601 0.368579 -0.061673 -0.065096 0.064194 -0.008998 -0.208894 0.059360 0.076025 -0.121372
polarizability: 3.26810432e+02 -1.28149878e+01 1.87166573e+02 -6.33027627e+00 -4.21986634e+00 6.91489906e+01
1716.lowfreq: -9.5562 -4.6759 -0.8623 0.0013 0.0016 0.0019 20.8305 27.0029 46.7859
frequency: 20.6999 26.8968 46.7739 57.7852 71.2280 119.7337 135.8395 167.4565 191.0404 213.8925 247.1080 307.3185 337.1909 338.8775 371.1670 404.5032 410.7954 418.2872 440.5501 481.1332 511.9745 534.3017 619.3212 632.6718 642.8157 651.2804 659.8591 695.6271 702.2292 705.2265 739.4360 789.9757 815.5474 832.6191 835.7089 846.6110 894.7611 929.0216 939.7129 969.0012 983.0731 988.8815 993.9958 1014.2991 1069.6059 1077.3170 1090.7195 1110.1402 1120.3407 1173.8847 1185.3851 1215.0285 1246.0696 1258.8885 1293.3970 1297.1052 1367.3241 1378.1922 1396.7153 1400.2214 1430.7451 1469.0563 1480.2600 1510.6529 1573.2029 1595.9400 1603.5957 1610.9571 1614.8839 3122.7604 3154.7512 3157.2144 3169.2269 3172.1155 3174.8304 3188.1680 3198.3396 3531.2421
redmass: 4.7929 8.9650 10.4352 9.9267 7.5576 6.5286 8.8341 5.8509 5.9002 8.2128 7.9891 5.8106 7.9884 6.4999 6.5904 8.7159 3.0096 3.2051 7.1541 6.0074 2.8159 6.0958 6.3934 3.3990 1.6123 6.9182 5.4268 2.4469 9.4468 3.5363 6.1281 8.5532 1.3926 1.8092 3.3082 1.4142 6.8625 1.5872 1.3633 1.3848 1.3215 5.9787 4.2282 1.3716 2.6925 2.0964 1.8085 1.8841 1.6518 1.1352 1.1149 7.0532 4.2447 1.8837 1.3429 1.4024 5.2440 10.5046 6.7107 4.4491 3.3437 2.5031 2.5981 2.2626 6.8669 6.0522 6.3051 4.7866 7.2126 1.0905 1.0882 1.0912 1.0913 1.0941 1.0952 1.0974 1.0955 1.0761
irintensity: 3.9046 0.1411 0.7722 0.5696 6.8923 2.8016 3.7581 0.3594 0.5089 2.4891 1.0825 8.7842 2.7511 0.2583 0.2427 16.0991 0.4850 2.0431 12.1298 2.9976 39.1452 0.6462 0.7110 5.8980 28.1155 8.5157 6.0236 63.7487 44.4073 0.3362 10.7054 14.0384 39.2163 26.7609 6.2706 63.5103 9.7622 18.5952 2.2021 1.7973 3.5560 2.0129 34.2122 2.6521 65.9450 11.2683 26.7446 40.2804 3.0989 27.8153 0.8001 281.1975 29.3072 36.4733 1.9810 22.8658 92.1755 135.7437 1.2824 17.8892 14.2251 16.5261 214.4637 376.3868 40.7104 43.3761 1.1687 87.6892 1.7272 11.8795 5.6545 4.8508 2.2147 6.0705 1.7047 2.8373 8.8692 11.4025
temp: 298.150 k
press: 1.00000 atm
elementType: 17 8 8 8 7 7 6 6 6 6 6 6 6 6 6 6 6 6 6 1 1 1 1 1 1 1 1 1
symmnumber: 1
zpe: 515438.0 jmol-1
zpe.correction: 0.196320 hartree
zpe.thermalcorrener: 0.212421 hartree
zpe.thermalcorrenthalpy: 0.213365 hartree
zpe.thermalcorrgfe: 0.149656 hartree
zpe.sumelectzpe: -1294.629614 hartree
zpe.sumelectthermal: -1294.613513 hartree
zpe.sumelectthermalent: -1294.612569 hartree
zpe.sumelectthermalfe: -1294.676278 hartree
dipole: -1.0353 1.5064 1.3745
dipole: 2.2870
quadrupole: -134.1689 -119.0159 -118.4735
quadrupole: -20.8575 -2.6993 -1.3510
quadrupole: -10.2828 4.8702 5.4126 -20.8575 -2.6993 -1.3510
hfenergy: -1294.8259342 hartree
pointgroup: C01 [X(C13H9Cl1N2O3)]
dipole: -0.3435466 0.6924285 -0.4605961 debye
polarizability: 322.6875118|-33.8550277|77.0505514|8.1540133|-21.6993251|183.3879322 unknown
InChI: InChI=1S/C13H9ClN2O3/c14-10-4-6-11(7-5-10)15-13(17)9-2-1-3-12(8-9)16(18)19/h1-8,15H
charge 0 multiplicity 1
28 atoms
Cl 6.90621 -0.672564 0.692627
O  0.622898 0.319526 -2.229091
O  -5.285235 0.264982 1.906558
O  -3.27828 -0.395075 2.761633
N  0.953668 0.277626 0.094511
N  -4.014537 0.074805 1.810891
C  -1.317503 0.558586 -0.800225
C  2.358884 0.056294 0.17505
C  0.162598 0.372674 -1.047547
C  -1.960207 0.226085 0.414914
C  -3.351198 0.42858 0.529408
C  -2.091334 1.065777 -1.877942
C  -4.129936 0.94635 -0.527594
C  -3.48153 1.260367 -1.740554
C  3.183268 -0.121606 -0.968513
C  2.936637 0.011496 1.473038
C  4.566791 -0.344784 -0.80337
C  4.318352 -0.209174 1.637259
C  5.117958 -0.38596 0.491073
H  -1.440417 -0.221394 1.268167
H  0.487878 0.418909 0.993609
H  -1.574502 1.287987 -2.816832
H  -5.205266 1.084414 -0.388149
H  -4.06206 1.656117 -2.579412
H  2.740173 -0.079269 -1.964569
H  2.308514 0.146253 2.362581
H  5.205649 -0.48352 -1.679948
H  4.760829 -0.244185 2.636424
