program: Gaussian 09
title: 000021710
version: EM64L-G09RevD.01
frameworkgroup: C1[X(C19H25ClN2O)]
method: RPBEPBE
basis: SDD
operation: Freq
keyword: #p
keyword: freq=noraman
keyword: PBEPBE/SDD
title: #p freq=noraman PBEPBE/SDD
converged: YES YES NO NO
title: Mulliken charges:
elementType: Cl O N N C C C C C C C C C C C C C C C C C C C H H H H H H H H H H H H H H H H H H H H H H H H H
charge: -0.029800 -0.290380 0.007288 -0.078320 -0.389715 -0.564204 -0.386717 0.232588 -0.395206 -0.504047 -0.022204 0.133867 0.277394 0.016110 -0.295666 -0.410003 -0.374470 -0.329852 -0.251426 -0.249491 -0.259608 -0.626286 -0.614297 0.205728 0.198233 0.211081 0.242457 0.187880 0.205526 0.213363 0.209159 0.245934 0.198180 0.214556 0.207717 0.229050 0.223329 0.262138 0.173138 0.206376 0.232742 0.255574 0.238962 0.184741 0.221954 0.225322 0.224369 0.186937
chargesum: 0.00000
title: Mulliken charges with hydrogens summed into heavy atoms:
elementType: Cl O N N C C C C C C C C C C C C C C C C C C C
charge: -0.029800 -0.290380 0.007288 -0.078320 0.014246 -0.110666 0.006689 0.232588 0.027316 -0.059934 -0.022204 0.133867 0.277394 0.016110 0.126606 0.042376 -0.112332 0.049662 -0.251426 -0.016749 -0.004034 0.019370 0.022331
polarizability: 2.86632266e+02 -7.61297948e+00 2.90714996e+02 1.60181981e+01 -3.93075785e+00 1.46963123e+02
1716.lowfreq: -0.0017 -0.0005 0.0008 5.0057 5.6907 10.2461 14.4525 30.8694 37.9357
frequency: 14.3479 30.6596 37.7732 52.7323 63.2860 71.7009 89.6456 94.2854 126.1190 134.4195 149.5357 167.4155 188.0560 201.7253 224.8679 241.8832 249.6653 261.4326 283.5873 301.1489 323.8407 329.3831 335.0291 354.4042 357.8569 386.8711 397.8130 429.6529 469.8547 476.3994 482.8557 488.3831 544.0438 555.8410 582.3982 583.5471 643.4709 684.6981 713.5183 734.2116 770.8872 777.8516 780.2913 803.5279 823.9816 827.8964 832.3822 857.3046 872.9974 876.9411 898.4157 908.8413 938.4055 952.8172 961.0723 980.1243 1024.8830 1034.4969 1037.4128 1043.1923 1062.4856 1068.4080 1071.7430 1082.1243 1093.5462 1098.1564 1110.5085 1121.5692 1132.1062 1141.4943 1165.6160 1172.7202 1190.7446 1202.3792 1217.0262 1220.5426 1250.8984 1252.4559 1261.2430 1267.1861 1271.4219 1287.1158 1298.4659 1309.8692 1317.0518 1324.7620 1338.7241 1342.2577 1354.1947 1364.3481 1369.2293 1377.6678 1389.3618 1416.2059 1420.3326 1436.3465 1444.2798 1459.6499 1461.0105 1462.0331 1462.9637 1463.5081 1469.3660 1472.6687 1475.7436 1477.5985 1480.0748 1481.7383 1487.4582 1495.2680 1538.5233 1578.7870 1610.0127 2812.9356 2842.5265 2858.9621 2952.1708 2957.3695 2967.1343 2968.7299 2971.4356 2978.5127 2998.0228 3006.7624 3009.9853 3017.2587 3019.4759 3027.2046 3033.0972 3039.4540 3055.1788 3072.3197 3075.9691 3078.7345 3090.5112 3141.8278 3161.7064 3174.0234
redmass: 4.9578 4.0380 3.0519 3.6975 3.9159 3.5546 1.9707 3.5916 3.6845 2.6859 4.6347 3.9490 4.3841 3.0408 2.5940 1.1757 1.4172 2.4428 3.9226 5.6610 3.0992 2.4800 2.2715 3.5558 3.7453 4.4014 3.6084 2.6094 2.6192 3.9698 2.4903 3.5788 4.1192 3.6754 5.2022 4.4490 5.0722 5.8354 4.8163 3.8611 1.1565 1.6927 2.7636 4.0166 2.9157 1.7493 3.2299 2.7001 1.3714 2.3636 3.4530 1.4033 5.7989 1.8596 2.2834 1.3223 2.4390 1.7474 2.8855 2.5130 2.0064 2.6215 1.8720 2.4997 1.3785 1.5395 2.3006 2.4513 1.3841 1.5017 1.2942 1.4193 1.5706 1.3666 1.8074 1.7995 1.5712 1.7859 2.0987 1.2842 1.2314 1.3332 1.3455 2.4404 1.4470 1.5328 1.4119 1.9917 1.4609 2.1038 2.7306 1.4953 1.7667 6.4149 1.1461 2.8732 1.1664 1.1658 1.0923 1.0701 1.0982 1.0532 2.2529 1.2405 1.0862 1.1253 1.0506 1.0919 1.0689 1.1155 7.5349 8.6818 7.3319 1.0703 1.0576 1.0575 1.0559 1.0616 1.0648 1.0665 1.0646 1.0620 1.0835 1.1053 1.0625 1.0959 1.0719 1.1024 1.0716 1.1025 1.0938 1.0940 1.1042 1.1013 1.1004 1.0864 1.0926 1.0988
irintensity: 0.0090 0.1949 0.7107 0.4670 1.4044 0.6242 1.0217 0.0131 0.5550 2.0993 1.2148 2.6796 0.0317 1.4989 0.2595 1.4807 0.2157 0.4118 5.4684 2.0946 0.3512 0.9160 9.7426 3.4335 0.6154 1.7620 3.1983 1.0805 1.2062 4.3388 5.4360 0.7197 0.7812 0.2914 0.7511 6.1242 3.6125 1.7286 35.4757 8.6605 0.8351 51.0073 29.6038 11.4784 17.7084 2.9410 9.8435 6.7328 1.2560 0.8553 10.3745 0.5871 156.7654 3.3483 38.0158 1.0792 11.4667 40.7491 17.6386 32.6933 2.5946 1.9329 4.6430 27.5198 5.9963 7.4877 3.6043 2.8262 12.2094 5.6292 15.6946 3.8776 31.5373 14.8938 8.3192 6.0879 7.2853 4.5983 4.4012 1.8422 0.1774 2.4099 2.3118 100.4128 2.4731 8.1036 2.7176 64.0829 0.7220 20.6018 5.5749 22.6664 17.4152 16.3279 2.6453 47.8881 3.2901 3.4350 5.8242 7.0522 7.4859 18.5860 41.8505 27.1255 8.8203 5.7095 12.4180 16.8628 30.9537 0.8724 9.6754 45.7511 3.1649 76.1122 70.1538 213.9441 32.5384 35.1731 28.4637 16.5573 31.5908 31.8153 16.0946 20.1077 30.0486 78.1793 44.2049 34.8637 43.5584 88.2743 22.4411 13.1622 24.7016 48.7360 43.5627 3.8789 6.4507 14.9520
temp: 298.150 k
press: 1.00000 atm
elementType: 17 8 7 7 6 6 6 6 6 6 6 6 6 6 6 6 6 6 6 6 6 6 6 1 1 1 1 1 1 1 1 1 1 1 1 1 1 1 1 1 1 1 1 1 1 1 1 1
symmnumber: 1
zpe: 1054474.6 jmol-1
zpe.correction: 0.401628 hartree
zpe.thermalcorrener: 0.424329 hartree
zpe.thermalcorrenthalpy: 0.425273 hartree
zpe.thermalcorrgfe: 0.347826 hartree
zpe.sumelectzpe: -1382.058105 hartree
zpe.sumelectthermal: -1382.035405 hartree
zpe.sumelectthermalent: -1382.034460 hartree
zpe.sumelectthermalfe: -1382.111907 hartree
dipole: -4.9794 1.8997 0.9777
dipole: 5.4184
quadrupole: -151.5323 -130.5829 -147.2614
quadrupole: 0.4569 -4.3569 -1.7780
quadrupole: -8.4068 12.5426 -4.1358 0.4569 -4.3569 -1.7780
hfenergy: -1382.4597335 hartree
pointgroup: C01 [X(C19H25Cl1N2O1)]
dipole: 1.9469941 -0.7914249 0.3567829 debye
polarizability: 285.782272|-7.4714422|291.0718527|-17.9803906|4.2126811|147.4562599 unknown
InChI: InChI=1S/C19H25ClN2O/c1-22(2)12-7-13-23-19-14-8-4-3-5-11-17(14)21-18-15(19)9-6-10-16(18)20/h6,9-10H,3-5,7-8,11-13H2,1-2H3
charge 0 multiplicity 1
48 atoms
Cl -5.019704 2.040851 0.724521
O  1.025818 0.208692 -0.980206
N  -3.076057 -0.210617 0.063811
N  5.782021 0.815806 0.240047
C  0.050463 -3.44923 0.317681
C  -0.120893 -2.473819 -0.885092
C  -1.184771 -4.336279 0.602724
C  -0.919679 -1.223172 -0.571314
C  -2.479877 -3.578227 0.97943
C  -3.031383 -2.635183 -0.129581
C  -2.322887 -1.29523 -0.219771
C  -0.332552 0.049248 -0.614618
C  -1.100885 1.235827 -0.344197
C  -2.494747 1.041644 0.002199
C  1.984618 0.151028 0.158254
C  3.374424 0.445643 -0.407942
C  -0.546699 2.55102 -0.422351
C  4.467469 0.286575 0.671449
C  -3.269169 2.218026 0.279587
C  -1.346372 3.662107 -0.145662
C  -2.719747 3.49853 0.213108
C  6.362681 0.080595 -0.902439
C  6.731306 0.907796 1.369044
H  0.911971 -4.112602 0.103659
H  0.314238 -2.870013 1.225875
H  -0.610849 -3.026643 -1.713116
H  0.871141 -2.165081 -1.258995
H  -1.387463 -4.956472 -0.296073
H  -0.934735 -5.043685 1.418833
H  -2.325105 -2.99515 1.908884
H  -3.263071 -4.327428 1.207549
H  -4.094265 -2.413577 0.064213
H  -2.972717 -3.162711 -1.104687
H  1.687576 0.899601 0.921452
H  1.938483 -0.85799 0.619745
H  3.406786 1.478484 -0.799812
H  3.551607 -0.238254 -1.258143
H  0.498512 2.664349 -0.725249
H  4.533717 -0.794009 0.974734
H  4.166518 0.853861 1.574926
H  -0.931373 4.673435 -0.20855
H  -3.343478 4.370995 0.428391
H  5.701302 0.149391 -1.782161
H  6.540346 -1.004192 -0.682267
H  7.330789 0.536702 -1.174939
H  6.298339 1.533339 2.170182
H  7.665879 1.3886 1.028981
H  6.997176 -0.086679 1.811688
