program: Gaussian 09
title: 000229329
version: EM64L-G09RevD.01
frameworkgroup: C1[X(C13H8ClN3O6)]
method: RPBEPBE
basis: SDD
operation: Freq
keyword: #p
keyword: freq=noraman
keyword: PBEPBE/SDD
title: #p freq=noraman PBEPBE/SDD
converged: YES YES NO NO
title: Mulliken charges:
elementType: Cl O O O O O O N N N C C C C C C C C C C C C C H H H H H H H H
charge: -0.033801 -0.324395 -0.378233 -0.188522 -0.149838 -0.211428 -0.185467 -0.462913 0.011066 0.013323 0.257459 -0.007510 -0.520079 0.349017 0.434985 0.247610 -0.521417 0.493786 -0.307676 -0.437991 -0.189186 -0.176977 -0.126700 0.255279 0.334670 0.335558 0.321076 0.233019 0.262451 0.263466 0.409368
chargesum: 0.00000
title: Mulliken charges with hydrogens summed into heavy atoms:
elementType: Cl O O O O O O N N N C C C C C C C C C C C C C
charge: -0.033801 0.084973 -0.378233 -0.188522 -0.149838 -0.211428 -0.185467 -0.127356 0.011066 0.013323 0.257459 -0.007510 -0.264800 0.349017 0.434985 0.247610 -0.186747 0.493786 0.013400 -0.204972 0.073265 0.086489 -0.126700
polarizability: 3.91513248e+02 -8.12559471e-01 2.34549216e+02 3.89445729e+00 -2.52322667e-01 7.68296923e+01
1716.lowfreq: -0.0014 -0.0010 -0.0007 1.6178 5.8813 6.8801 20.4437 29.0943 43.6154
frequency: 20.4434 29.0731 43.6141 54.4043 61.5925 64.1779 108.5099 119.6735 128.3943 150.4378 161.9139 188.2812 197.1931 246.7705 304.6547 316.6164 328.7402 336.7044 345.4895 389.8108 397.1841 410.8285 429.5582 450.2332 481.4624 508.3903 515.8089 525.1685 605.2212 623.5798 636.7164 651.8107 660.3392 685.3310 702.3836 704.9989 707.1497 719.5324 769.0626 784.8507 795.5978 818.1217 843.7726 847.3741 890.3525 924.0310 926.5730 944.4172 962.5500 984.5059 995.4843 1030.3505 1076.1373 1083.5715 1117.0417 1132.0636 1173.0316 1188.6261 1202.3000 1217.8869 1247.3107 1269.7879 1293.5007 1304.6027 1329.3070 1368.3256 1377.2129 1381.0130 1405.1926 1422.1962 1428.5631 1463.7000 1479.6387 1530.6097 1571.5372 1595.9058 1603.3978 1605.3623 1644.2608 2478.0071 3122.2130 3149.3265 3171.2909 3177.5812 3185.9556 3209.6368 3541.7387
redmass: 6.2048 6.7959 14.7171 12.2232 11.4159 8.6847 9.7099 10.3333 12.0526 6.5960 10.7444 9.5096 5.9619 8.9376 8.7880 6.7273 12.1031 5.4889 8.0581 10.8131 8.1660 3.0545 7.1207 8.6888 5.9082 2.9331 5.1722 4.9215 7.0958 7.1462 4.6379 1.7727 9.9117 4.8758 10.6770 4.7948 4.2014 6.1532 9.6530 7.2315 6.2202 1.3866 6.1244 1.4016 9.2663 5.7796 1.7370 1.3607 1.5191 1.3197 4.1448 1.0607 2.8418 1.9444 1.4711 3.1064 2.1504 1.1190 12.4730 4.0020 2.7866 2.5853 4.1249 1.5231 2.0125 9.1914 9.7216 7.5958 3.9458 4.0541 5.1464 3.8431 2.6009 2.3630 7.2997 4.2442 6.0117 3.8538 3.9795 1.0761 1.0909 1.0912 1.0918 1.0952 1.0930 1.0948 1.0757
irintensity: 0.0051 1.6376 0.5743 1.5211 0.7124 0.4553 9.9063 1.2296 3.7207 0.1461 1.0994 0.9174 0.9757 0.4268 0.5804 9.2901 0.3630 1.2559 9.6736 5.1195 1.2027 0.0971 14.3814 56.4252 36.0848 34.6283 0.9752 3.4136 5.3691 1.8853 4.2558 28.3291 28.2451 27.7314 82.4898 9.9620 5.5043 1.2448 5.8005 1.3498 14.7281 42.8377 3.9853 57.7121 30.8723 28.1905 12.3983 1.2394 24.1681 0.2003 41.4412 150.2019 68.3806 28.5311 40.4615 4.2306 45.2732 1.7507 376.7932 333.7066 48.4263 6.1754 37.4195 2.4864 323.2258 109.0122 120.9974 62.0030 24.2230 95.1275 46.8017 155.6554 182.8227 360.0915 154.5378 88.7236 17.8412 75.3396 112.1301 1124.0294 9.6298 5.3678 1.1772 1.0580 26.2415 7.6948 15.7273
temp: 298.150 k
press: 1.00000 atm
elementType: 17 8 8 8 8 8 8 7 7 7 6 6 6 6 6 6 6 6 6 6 6 6 6 1 1 1 1 1 1 1 1
symmnumber: 1
zpe: 526817.9 jmol-1
zpe.correction: 0.200654 hartree
zpe.thermalcorrener: 0.220222 hartree
zpe.thermalcorrenthalpy: 0.221167 hartree
zpe.thermalcorrgfe: 0.149552 hartree
zpe.sumelectzpe: -1574.072742 hartree
zpe.sumelectthermal: -1574.053174 hartree
zpe.sumelectthermalent: -1574.052229 hartree
zpe.sumelectthermalfe: -1574.123844 hartree
dipole: 5.9898 2.0690 0.1775
dipole: 6.3395
quadrupole: -176.0478 -158.0917 -139.5529
quadrupole: -0.4363 -1.0598 2.6378
quadrupole: -18.1503 -0.1942 18.3446 -0.4363 -1.0598 2.6378
hfenergy: -1574.273396 hartree
pointgroup: C01 [X(C13H8Cl1N3O6)]
dipole: 2.2963614 0.8869176 -0.4011784 debye
polarizability: 390.8194808|11.8112359|196.2022184|1.275501|-68.1437342|115.8704574 unknown
InChI: InChI=1S/C13H8ClN3O6/c14-7-1-3-8(4-2-7)15-13(19)10-5-9(16(20)21)6-11(12(10)18)17(22)23/h1-6,15,18H
charge 0 multiplicity 1
31 atoms
Cl 7.625923 0.341124 -0.168719
O  -1.30697 -2.402473 1.203515
O  1.023403 -1.706124 0.783553
O  -5.253483 -2.036012 0.401573
O  -3.887136 -2.500169 2.174382
O  -2.272443 3.094194 -1.845357
O  -4.43491 2.450588 -1.48034
N  1.57212 0.34387 -0.186487
N  -4.147908 -1.915597 1.061592
N  -3.161817 2.276357 -1.379706
C  -0.798839 -0.286052 0.084699
C  -1.732183 -1.257514 0.628186
C  -1.294029 0.862186 -0.562081
C  -3.134329 -0.989292 0.496539
C  -2.680262 1.065007 -0.686425
C  0.657688 -0.585026 0.242071
C  -3.612674 0.142696 -0.17117
C  2.9995 0.279095 -0.151599
C  3.722223 -0.834065 0.353369
C  3.69901 1.406731 -0.659338
C  5.132556 -0.807651 0.344377
C  5.106393 1.431705 -0.667061
C  5.8085 0.318429 -0.162732
H  -0.652178 1.630705 -1.005489
H  -4.687039 0.306516 -0.291226
H  1.199965 1.210107 -0.580902
H  3.185726 -1.698376 0.7450
H  3.149122 2.271406 -1.051967
H  5.69585 -1.661323 0.731616
H  5.644516 2.299483 -1.057695
H  -0.248394 -2.390925 1.158823
