program: Gaussian 09
title: 000229314
version: EM64L-G09RevD.01
frameworkgroup: C1[X(C13H14ClNO2)]
method: RPBEPBE
basis: SDD
operation: Freq
keyword: #p
keyword: freq=noraman
keyword: PBEPBE/SDD
title: #p freq=noraman PBEPBE/SDD
converged: YES YES NO NO
title: Mulliken charges:
elementType: Cl O O N C C C C C C C C C C C C C H H H H H H H H H H H H H H
charge: -0.089449 -0.418145 -0.230478 -0.455701 0.250378 -0.552185 0.149960 0.154840 -0.381307 0.216844 -0.470156 -0.399485 -0.801162 -0.340925 -0.117165 -0.217042 0.174625 0.212664 0.200610 0.233448 0.236143 0.303190 0.246262 0.252916 0.257197 0.236204 0.244962 0.243680 0.233088 0.249749 0.376444
chargesum: 0.00000
title: Mulliken charges with hydrogens summed into heavy atoms:
elementType: Cl O O N C C C C C C C C C C C C C
charge: -0.089449 -0.041701 -0.230478 -0.152511 0.250378 -0.138911 0.149960 0.154840 0.088284 0.216844 0.029022 -0.142288 -0.076317 -0.107838 -0.117165 0.032707 0.174625
polarizability: 1.91905994e+02 -1.91381034e+01 1.98766213e+02 1.86844726e+01 9.54018037e+00 1.03382334e+02
1716.lowfreq: -5.6830 -0.0029 -0.0026 -0.0012 3.2779 6.7996 12.6587 17.5767 48.7429
frequency: 11.7765 17.1866 48.7369 75.9653 78.4659 85.1775 97.6558 138.1994 163.6172 182.0592 203.0583 255.3731 276.8794 308.4037 343.7224 344.2416 378.8742 426.5914 461.1787 500.0316 505.0007 508.5066 542.6367 581.5456 584.6919 618.5694 646.7576 663.6953 671.4544 736.4980 744.7933 765.7201 792.6220 819.9233 857.1065 866.4545 869.1759 924.0307 925.1972 982.6321 1012.4067 1041.3163 1046.1837 1051.4924 1070.5568 1084.6306 1120.2768 1141.4948 1163.3334 1230.2909 1233.3692 1240.9485 1255.0517 1275.6144 1285.0231 1300.5426 1307.3589 1337.1594 1366.8999 1397.1090 1411.9900 1428.4711 1439.8122 1453.3401 1466.6487 1468.1051 1472.1634 1476.9512 1487.2376 1573.0158 1594.5156 1632.0409 1668.6177 2964.5150 2969.1636 2977.8626 3007.0633 3013.0284 3038.2709 3040.5000 3073.3334 3097.3620 3139.7536 3160.0937 3174.8167 3509.0113 3604.8580
redmass: 10.0098 8.1846 5.4346 3.1919 3.1486 1.7229 1.1924 5.0303 4.2995 4.7210 5.6649 3.6582 3.1153 4.5189 6.0328 6.9040 6.0381 2.8965 3.6089 1.2606 2.7542 2.3055 4.2512 3.4907 3.6799 4.5800 1.3823 5.0377 5.9453 1.2476 3.8233 4.3977 1.5440 1.9254 3.0914 1.5894 3.9276 2.8068 1.3560 1.5429 3.4961 1.5796 2.2134 2.4369 2.3651 2.4866 1.7890 1.3953 1.8660 1.3771 1.3822 2.1304 1.2864 1.5182 1.2919 1.5553 3.3716 1.6065 1.8145 1.7389 2.2216 2.8320 1.0847 4.3084 1.1597 1.0788 2.3536 1.3390 1.1278 7.1735 6.8092 6.8367 8.3026 1.0602 1.0393 1.0646 1.0629 1.0967 1.0981 1.0954 1.1030 1.0951 1.0898 1.0928 1.0956 1.0639 1.0804
irintensity: 0.9548 1.0770 1.4825 0.4417 1.1862 0.0682 0.2677 0.8203 0.3487 0.6682 0.4092 1.8768 0.8319 0.3571 2.1756 3.3348 2.2376 6.5266 28.1220 78.4937 17.9721 36.6959 6.6565 30.3978 8.0938 8.0339 120.0608 0.0391 14.1586 14.8368 10.1188 9.9439 51.4033 0.7280 8.5146 19.5162 4.0031 28.0037 1.4119 1.2073 142.9359 22.7772 21.6764 68.8680 15.4722 59.3611 24.0979 1.4550 3.5984 6.7734 4.4654 17.7456 0.7405 41.2369 4.7029 21.5132 32.8027 17.0103 35.6683 5.5166 51.7834 28.4849 22.0404 3.0543 6.0237 16.4049 65.3540 15.9961 16.4454 6.1743 32.5267 2.1461 200.6520 34.0066 55.8498 14.5680 19.4764 18.4631 19.4089 1.1596 35.0714 15.7728 10.1084 2.8316 4.9502 18.9521 53.8452
temp: 298.150 k
press: 1.00000 atm
elementType: 17 8 8 7 6 6 6 6 6 6 6 6 6 6 6 6 6 1 1 1 1 1 1 1 1 1 1 1 1 1 1
symmnumber: 1
zpe: 635861.9 jmol-1
zpe.correction: 0.242187 hartree
zpe.thermalcorrener: 0.259049 hartree
zpe.thermalcorrenthalpy: 0.259994 hartree
zpe.thermalcorrgfe: 0.194012 hartree
zpe.sumelectzpe: -1167.832389 hartree
zpe.sumelectthermal: -1167.815527 hartree
zpe.sumelectthermalent: -1167.814582 hartree
zpe.sumelectthermalfe: -1167.880564 hartree
dipole: -0.9517 4.7831 -0.7842
dipole: 4.9395
quadrupole: -100.5064 -94.2667 -113.5271
quadrupole: 13.8080 9.8127 1.6719
quadrupole: 2.2603 8.5000 -10.7603 13.8080 9.8127 1.6719
hfenergy: -1168.0745759 hartree
pointgroup: C01 [X(C13H14Cl1N1O2)]
dipole: -0.1916388 -1.9119836 0.2902055 debye
polarizability: 188.5286987|18.2256658|202.2618881|-18.7754503|8.6843953|103.2639544 unknown
InChI: InChI=1S/C13H14ClNO2/c1-8-10(3-2-4-13(16)17)11-7-9(14)5-6-12(11)15-8/h5-7,15-16H,2-4H2,1H3
charge 0 multiplicity 1
31 atoms
Cl 2.944083 3.655067 0.260103
O  -5.509378 1.541043 0.177726
O  -4.454462 0.539985 -1.631028
N  1.952986 -2.208802 -0.352804
C  0.20944 -1.022099 0.530836
C  -1.138468 -0.634149 1.088406
C  1.305198 -0.109814 0.251839
C  0.637933 -2.299736 0.147787
C  -2.10631 -0.071804 0.01082
C  2.388063 -0.881433 -0.301531
C  -3.438981 0.394425 0.628962
C  1.469659 1.290078 0.427516
C  -0.068828 -3.624337 0.195979
C  3.614782 -0.296775 -0.679595
C  2.696615 1.850733 0.045931
C  3.766116 1.094769 -0.501461
C  -4.465396 0.804329 -0.409226
H  -1.001935 0.12884 1.882194
H  -1.617403 -1.503923 1.580664
H  -1.623464 0.771107 -0.517937
H  -2.302091 -0.842428 -0.756797
H  2.497037 -2.996955 -0.697267
H  -3.891944 -0.42062 1.231327
H  -3.293572 1.238336 1.328532
H  0.67403 1.91355 0.845335
H  0.502111 -4.375413 0.775607
H  -1.056425 -3.51656 0.672628
H  -0.234644 -4.040324 -0.81685
H  4.434817 -0.888776 -1.099953
H  4.698276 1.593362 -0.780951
H  -6.177247 1.773724 -0.523788
