program: Gaussian 09
title: 000229306
version: EM64L-G09RevD.01
frameworkgroup: C1[X(C10H9ClN2O3)]
method: RPBEPBE
basis: SDD
operation: Freq
keyword: #p
keyword: freq=noraman
keyword: PBEPBE/SDD
title: #p freq=noraman PBEPBE/SDD
converged: YES YES NO NO
title: Mulliken charges:
elementType: Cl O O O N N C C C C C C C C C C H H H H H H H H H
charge: -0.066549 -0.226416 -0.424335 -0.226693 -0.369380 -0.384684 0.474402 -0.408179 -0.321569 -0.184433 -0.192860 -0.120826 0.209655 -0.224605 -0.267577 0.182029 0.229727 0.237087 0.311053 0.253649 0.251863 0.333766 0.283503 0.263712 0.387660
chargesum: 0.00000
title: Mulliken charges with hydrogens summed into heavy atoms:
elementType: Cl O O O N N C C C C C C C C C C
charge: -0.066549 -0.226416 -0.036675 -0.226693 -0.058327 -0.050918 0.474402 -0.178452 -0.084482 0.069216 0.059004 -0.120826 0.209655 0.058898 -0.003865 0.182029
polarizability: 2.14548137e+02 -4.70214308e+00 1.46252340e+02 -7.94780128e+00 6.52692934e+00 7.94977359e+01
1716.lowfreq: -1.9214 -0.0021 -0.0016 -0.0011 4.3251 6.6956 18.9228 25.0523 33.7336
frequency: 18.7942 25.0248 33.7144 47.7724 87.2188 106.2122 133.8014 157.8479 182.8350 236.9917 243.0039 286.7261 314.0802 349.8312 373.3284 409.3130 438.5555 459.6877 509.3846 529.1085 536.3745 581.3192 583.6739 623.8857 647.4008 671.1541 695.0020 718.2145 732.5044 804.6846 816.3523 829.1572 886.4404 923.5524 931.5434 932.3911 946.3240 989.1772 996.0752 1052.3380 1073.4605 1108.3238 1157.8425 1178.3105 1219.2714 1238.5447 1262.2389 1289.1390 1304.5700 1328.2371 1364.3926 1406.9891 1445.0221 1479.7979 1493.2432 1588.6215 1600.2345 1614.1713 1643.4402 1654.8524 3131.6211 3145.2486 3153.4043 3153.7860 3170.8122 3175.2042 3491.6095 3520.4994 3524.8735
redmass: 8.9648 8.7109 4.0639 11.4116 7.2023 7.3144 5.8203 2.6374 9.0179 3.6062 6.6719 5.8429 3.4293 7.3431 6.6176 2.9623 3.5903 2.4364 2.7086 3.4039 1.4970 2.3076 2.8203 6.8671 2.0511 4.1077 3.3686 4.9089 7.2052 1.2964 1.6787 3.8591 2.3719 6.9450 1.3443 3.8890 1.3534 3.9572 1.1131 2.1496 2.7185 1.4101 3.8135 1.1111 1.3183 2.7016 1.3904 1.2836 3.2594 2.1486 4.1249 4.3090 1.5895 2.4708 1.4455 8.2765 5.3736 6.4353 9.1995 6.3144 1.0897 1.0958 1.0878 1.0889 1.0954 1.0969 1.0763 1.0788 1.0643
irintensity: 3.9221 0.6414 0.3323 1.0692 0.5896 1.4607 2.5657 10.1357 0.8444 10.7640 1.2786 5.5867 6.9834 9.5374 14.5449 0.3647 44.7959 51.3375 15.6555 49.5475 198.6338 72.5044 20.9611 1.2424 99.6593 13.3943 0.3575 14.9475 17.0393 4.7611 71.9895 33.2034 2.2293 14.6382 0.1198 8.4145 0.2430 21.8837 56.9403 322.5982 34.4886 2.0256 38.8802 11.0711 26.6119 144.5291 17.5547 0.7398 11.6639 99.9215 14.3609 0.0541 134.9812 196.6437 45.6262 167.0858 26.6895 57.3689 209.1951 15.4646 10.7162 1.1854 4.2304 10.2373 8.2369 1.9674 23.4283 31.5468 53.9727
temp: 298.150 k
press: 1.00000 atm
elementType: 17 8 8 8 7 7 6 6 6 6 6 6 6 6 6 6 1 1 1 1 1 1 1 1 1
symmnumber: 1
zpe: 465099.5 jmol-1
zpe.correction: 0.177147 hartree
zpe.thermalcorrener: 0.192694 hartree
zpe.thermalcorrenthalpy: 0.193638 hartree
zpe.thermalcorrgfe: 0.130659 hartree
zpe.sumelectzpe: -1180.512735 hartree
zpe.sumelectthermal: -1180.497188 hartree
zpe.sumelectthermalent: -1180.496244 hartree
zpe.sumelectthermalfe: -1180.559222 hartree
dipole: 2.1899 -0.2781 -3.7103
dipole: 4.3173
quadrupole: -109.2044 -90.9783 -105.8319
quadrupole: -16.6264 -8.1345 -5.4225
quadrupole: -7.1995 11.0266 -3.8270 -16.6264 -8.1345 -5.4225
hfenergy: -1180.6898819 hartree
pointgroup: C01 [X(C10H9Cl1N2O3)]
dipole: 0.7513096 0.5942813 1.402672 debye
dipolederiv: -0.5979542 0.2328412 -0.2580652 0.2727137 -0.2577211 0.1730625 -0.3042684 0.1739381 -0.2454684 -0.6176777 -0.2347164 -0.0758459 0.1493278 -0.7598152 -0.2682903 0.3344568 -0.1837818 -0.5153659 -0.4029239 -0.2729512 -0.0667274 -0.313984 -1.2924842 -0.1009696 -0.0568152 -0.0814805 -0.4308135 -1.0292403 0.1375838 0.1098378 0.0672573 -0.6713999 -0.0665794 0.1343363 -0.07484 -0.3467365 -0.6160987 0.231277 -0.2330426 0.3999196 -0.1020201 -0.0157899 -0.6567268 0.2643462 -0.7226069 -0.3130544 0.2066667 0.1750436 0.7068609 -0.5385303 0.0398165 0.446025 -0.0927396 -0.342344 0.9348636 -0.4241369 0.4640244 -0.7748239 0.2263536 -0.1972386 0.6840931 -0.2292058 0.4119586 -0.3331893 0.2258308 -0.1451056 0.0388844 -0.001711 -0.1299423 -0.0399326 -0.0479243 -0.1544884 -0.0869687 0.0139127 0.0101468 0.3560009 -0.1528585 0.0354831 -0.1825808 -0.028817 -0.2094148 -0.0664493 0.0537703 -0.0097988 0.1005391 0.0163092 -0.030657 -0.0538087 -0.0483744 -0.0636698 -0.0171883 0.1366614 -0.0572223 0.042851 -0.0117145 -0.0267323 0.0025693 -0.0148952 -0.07589 0.6418764 -0.392609 0.4237824 -0.4184621 0.163729 -0.2624892 0.4523157 -0.2636067 0.1643917 1.1865043 0.1920507 -0.2095749 -0.4279716 0.882992 0.4517891 -0.822812 0.406271 0.7057156 -0.1728833 -0.1035664 -0.0078699 0.0785121 0.1032388 0.0146134 0.0153572 0.0619085 -0.0868444 -0.4505782 -0.2820266 -0.0182705 -0.4092919 -0.2084212 0.0273482 0.0584504 0.0476037 -0.1336922 1.625286 0.3457999 -0.124817 0.3192309 1.5935067 0.1689174 -0.1843791 0.1404245 0.3057074 0.0899932 0.0062716 -0.0258095 -0.0157115 -0.0363909 0.1202871 -0.0177652 0.1157497 0.0851236 -0.0643853 -0.0737421 -0.0185031 -0.1047818 0.0915951 0.0386664 -0.005127 0.0254868 0.1219991 0.0123174 0.0237117 -0.0220906 -0.0281861 0.1271922 0.0340463 0.0464509 -0.1082732 0.3552854 -0.0347679 -0.0621144 -0.0088885 -0.0554487 0.094209 0.0245164 -0.017959 0.0235595 0.1455871 0.0970312 -0.0243731 -0.0013299 -0.0166764 0.0041118 0.0873178 -0.0086099 0.0877278 0.1065767 0.0733498 -0.0401669 -0.0117276 -0.1847194 0.2170548 -0.0530609 0.0592808 -0.0982232 0.2259646 0.0112659 0.024123 0.0171368 0.029957 0.0897405 -0.0295962 0.0152787 -0.0375161 0.1562314 -0.0030713 0.049466 0.0393392 0.1063488 0.0560233 -0.0200148 0.0434703 -0.0272375 0.150813 0.1339431 0.0304361 0.0553782 0.081654 0.367011 -0.0145037 0.0587004 -0.0101006 0.3919805 unknown
polarizability: 212.6961945|5.2917441|141.0416615|18.2588172|-18.0056443|86.5603576 unknown
InChI: InChI=1S/C10H9ClN2O3/c11-7-1-3-8(4-2-7)12-13-9(14)5-6-10(15)16/h1-6,12-13,15H
charge 0 multiplicity 1
25 atoms
Cl -5.320954 1.561929 -1.69319
O  0.941012 -2.450865 -0.534028
O  4.696937 2.125296 0.10664
O  5.52383 -0.009015 -0.341664
N  -0.783664 -1.162794 1.266167
N  0.551565 -0.78779 1.059863
C  -1.814032 -0.524748 0.518914
C  -3.111829 -1.103369 0.525687
C  -1.597985 0.695972 -0.169465
C  -4.177365 -0.473503 -0.147333
C  -2.664354 1.329584 -0.84342
C  -3.941622 0.740396 -0.82329
C  1.361508 -1.465513 0.139409
C  2.766647 -0.966079 0.018341
C  3.143622 0.337517 0.139672
C  4.558595 0.739537 -0.064127
H  -3.291194 -2.0467 1.054829
H  -0.6008 1.144878 -0.19315
H  -0.90001 -2.169034 1.426021
H  -5.174598 -0.922925 -0.145787
H  -2.496935 2.26812 -1.379787
H  0.95977 -0.150735 1.747881
H  3.510071 -1.721562 -0.265264
H  2.438156 1.14697 0.356746
H  5.648029 2.38423 -0.032467
