program: Gaussian 09
title: 000229305
version: EM64L-G09RevD.01
frameworkgroup: C1[X(C10H9BrN2O3)]
method: RPBEPBE
basis: SDD
operation: Freq
keyword: #p
keyword: freq=noraman
keyword: PBEPBE/SDD
title: #p freq=noraman PBEPBE/SDD
converged: YES YES NO NO
title: Mulliken charges:
elementType: Br O O O N N C C C C C C C C C C H H H H H H H H H
charge: -0.000714 -0.226128 -0.424295 -0.226501 -0.370356 -0.384698 0.475261 -0.411944 -0.327096 -0.152365 -0.160995 -0.235746 0.210524 -0.224461 -0.267193 0.181968 0.231017 0.238291 0.311584 0.248637 0.246628 0.333785 0.283573 0.263481 0.387743
chargesum: 0.00000
title: Mulliken charges with hydrogens summed into heavy atoms:
elementType: Br O O O N N C C C C C C C C C C
charge: -0.000714 -0.226128 -0.036552 -0.226501 -0.058773 -0.050913 0.475261 -0.180926 -0.088804 0.096272 0.085633 -0.235746 0.210524 0.059112 -0.003712 0.181968
polarizability: 2.29958229e+02 -3.09187903e+00 1.50848529e+02 -7.56785513e+00 8.78078131e+00 8.13510231e+01
1716.lowfreq: -9.0419 -4.1302 -0.0007 -0.0006 0.0001 2.7193 12.8520 20.9377 33.0448
frequency: 12.6239 20.8987 33.0218 45.8456 82.2113 96.7136 129.2620 154.6406 172.6607 220.1684 227.9693 268.4140 285.6578 318.4114 371.6488 407.0265 426.7257 452.4458 510.8116 520.3129 537.1874 579.4139 582.3110 621.7981 642.7420 661.6341 697.3034 717.4601 732.2326 807.4275 818.8883 827.9928 885.5284 923.3918 931.7445 937.4675 952.9118 985.2680 995.2343 1052.9159 1060.6304 1109.7132 1157.7656 1181.1686 1217.1979 1236.8810 1261.1464 1289.3078 1304.8146 1327.3449 1359.6235 1403.8796 1444.2071 1474.8239 1491.9603 1587.1529 1596.6233 1611.0134 1643.5187 1654.7712 3131.2055 3145.1674 3152.5585 3152.8425 3170.2140 3174.7190 3492.2095 3520.7059 3525.3245
redmass: 9.0704 9.4441 4.0280 11.2036 7.5966 6.6798 5.9475 2.6314 8.7916 4.6222 5.9337 7.0912 3.5985 4.1817 6.6888 2.9462 4.1988 2.2699 2.7710 3.8430 1.3853 4.3921 1.8428 6.7106 2.4015 2.9784 3.3640 4.9640 7.1092 1.3211 1.6870 3.6159 2.3714 6.9167 3.9212 1.3422 1.3564 4.5257 1.1109 2.1592 2.5894 1.4462 3.6730 1.1129 1.3161 2.6588 1.3859 1.2793 3.2085 2.1682 4.0616 4.2966 1.5939 2.4634 1.4425 7.7380 5.2940 6.3451 9.1952 6.3176 1.0897 1.0964 1.0884 1.0878 1.0953 1.0968 1.0764 1.0788 1.0643
irintensity: 3.9240 0.6627 0.2919 1.0338 0.5323 1.2155 3.1990 10.0176 0.6677 5.3276 2.1548 12.3225 10.8376 1.4592 9.6499 0.5839 29.6754 78.1487 28.2201 74.9340 155.2631 55.9472 29.6859 3.5207 91.9554 27.7668 0.3610 15.4389 16.5838 7.0152 62.3768 41.0117 2.2751 14.7588 9.3695 0.0740 0.2700 31.9875 56.1008 320.7947 27.2812 0.9034 38.8257 14.9861 30.6819 155.4093 16.5856 0.1925 15.7600 98.5357 16.5533 0.3062 136.9339 200.3075 43.9484 145.4083 50.6144 62.7492 210.8557 15.6113 11.0656 1.4626 1.7234 12.5514 10.5000 2.3725 24.4738 31.7289 54.3233
temp: 298.150 k
press: 1.00000 atm
elementType: 35 8 8 8 7 7 6 6 6 6 6 6 6 6 6 6 1 1 1 1 1 1 1 1 1
symmnumber: 1
zpe: 463713.3 jmol-1
zpe.correction: 0.176619 hartree
zpe.thermalcorrener: 0.192429 hartree
zpe.thermalcorrenthalpy: 0.193373 hartree
zpe.thermalcorrgfe: 0.128598 hartree
zpe.sumelectzpe: -733.912236 hartree
zpe.sumelectthermal: -733.896426 hartree
zpe.sumelectthermalent: -733.895482 hartree
zpe.sumelectthermalfe: -733.960256 hartree
dipole: 2.2903 -0.2878 -3.6853
dipole: 4.3486
quadrupole: -109.8321 -90.6637 -109.2512
quadrupole: -13.7797 -12.3025 -4.9743
quadrupole: -6.5831 12.5853 -6.0022 -13.7797 -12.3025 -4.9743
hfenergy: -734.0888547 hartree
pointgroup: C01 [X(C10H9Br1N2O3)]
dipole: 0.7743045 0.5639702 1.4175455 debye
dipolederiv: -0.4999039 0.2185325 -0.2247926 0.2516821 -0.1983884 0.1444956 -0.2617532 0.1454303 -0.1837523 -0.6196284 -0.2306643 -0.0829757 0.1468357 -0.7512229 -0.2701602 0.3447276 -0.190886 -0.5223124 -0.4072346 -0.2705335 -0.0765013 -0.3173643 -1.2841037 -0.1260049 -0.0659511 -0.1042844 -0.43571 -1.0330364 0.1371086 0.1147526 0.0625814 -0.6671759 -0.0764612 0.141533 -0.0855227 -0.3519264 -0.6507102 0.2513698 -0.2440151 0.426124 -0.1129413 -0.0012269 -0.681162 0.287986 -0.7291442 -0.3186877 0.204005 0.178099 0.7167704 -0.54446 0.0411233 0.4705719 -0.1015113 -0.3424587 0.9890423 -0.4429745 0.4651397 -0.8029209 0.2576253 -0.2063618 0.6847107 -0.2391606 0.4153626 -0.3572451 0.218277 -0.1372256 0.0518263 -0.0092186 -0.1169376 -0.0489436 -0.0418552 -0.1630892 -0.1104161 0.0268428 -0.0023382 0.3527404 -0.1646475 0.0399347 -0.175454 -0.01971 -0.2137441 -0.0916782 0.1157195 -0.0535387 0.0916076 0.0223218 -0.0254951 -0.055644 -0.0251277 -0.0680006 -0.0408196 0.1291395 -0.0597437 0.1085858 -0.0040552 -0.0061488 -0.043729 -0.010665 -0.0785239 0.6426526 -0.4475733 0.4544155 -0.472171 0.1204535 -0.2728909 0.4795211 -0.2753653 0.1120723 1.1962755 0.1929184 -0.2010452 -0.4196641 0.8696729 0.4491694 -0.8510349 0.4153052 0.7221769 -0.1757825 -0.1029025 -0.0109595 0.075797 0.0986713 0.0205604 0.0198811 0.0670463 -0.0835493 -0.4538361 -0.27862 -0.0266335 -0.4118596 -0.2080744 0.0261927 0.0495866 0.0468816 -0.1310161 1.6337989 0.3446511 -0.1171508 0.3298626 1.5814085 0.2061648 -0.1851924 0.1755006 0.3166596 0.0814763 0.0125344 -0.0311316 -0.0086434 -0.0439231 0.120416 -0.0245847 0.1154588 0.0898184 -0.0698814 -0.069556 -0.0237445 -0.1011145 0.0876865 0.0413058 -0.0119319 0.0282707 0.1223307 0.0103035 0.0232324 -0.0199152 -0.0312966 0.1293479 0.0291568 0.0524281 -0.114386 0.3565968 -0.041062 -0.0648243 -0.0083089 -0.0621469 0.0908402 0.0203591 -0.0155386 0.0205405 0.1444108 0.0994937 -0.0266332 0.0013059 -0.0160978 -0.0074847 0.0862473 -0.0077863 0.0861108 0.106648 0.0728448 -0.0403036 -0.0122148 -0.1879122 0.2216573 -0.054161 0.0583667 -0.0993646 0.2237909 0.0108098 0.0236241 0.0181392 0.0292227 0.0917258 -0.0315125 0.0165722 -0.0393138 0.1540705 -0.0022154 0.0479321 0.0422899 0.1066507 0.0569851 -0.0226425 0.0482405 -0.030475 0.1488671 0.1354401 0.0286979 0.0580934 0.0809047 0.3672994 -0.0151226 0.0625661 -0.0109032 0.3904226 unknown
polarizability: 226.0196601|-1.2243379|146.2178961|24.3272393|-20.0635161|89.9202249 unknown
InChI: InChI=1S/C10H9BrN2O3/c11-7-1-3-8(4-2-7)12-13-9(14)5-6-10(15)16/h1-6,12-13,15H
charge 0 multiplicity 1
25 atoms
Br -5.444991 1.640309 -1.691104
O  0.949434 -2.434484 -0.59508
O  4.709257 2.125501 0.145092
O  5.531938 0.004534 -0.369505
N  -0.76555 -1.192834 1.244456
N  0.567118 -0.809137 1.038917
C  -1.803142 -0.542817 0.519748
C  -3.097602 -1.127982 0.519422
C  -1.598544 0.694822 -0.140647
C  -4.170327 -0.488404 -0.132669
C  -2.6723 1.338514 -0.793347
C  -3.949371 0.744193 -0.783043
C  1.372942 -1.464793 0.098629
C  2.776887 -0.961309 -0.018513
C  3.155125 0.338237 0.137003
C  4.569091 0.7453 -0.064454
H  -3.269564 -2.084828 1.026366
H  -0.604165 1.150274 -0.159447
H  -0.878494 -2.201831 1.388053
H  -5.162879 -0.947749 -0.133191
H  -2.507596 2.290852 -1.305717
H  0.978156 -0.18766 1.739412
H  3.518174 -1.708616 -0.328228
H  2.451662 1.141588 0.381533
H  5.659542 2.38812 0.007413
