program: Gaussian 09
title: 000229304
version: EM64L-G09RevD.01
frameworkgroup: C1[X(C10H7ClN2O2)]
method: RPBEPBE
basis: SDD
operation: Freq
keyword: #p
keyword: freq=noraman
keyword: PBEPBE/SDD
title: #p freq=noraman PBEPBE/SDD
converged: YES YES NO NO
title: Mulliken charges:
elementType: Cl O O N N C C C C C C C C C C H H H H H H H
charge: -0.037766 -0.256003 -0.262954 -0.180882 -0.362497 0.461797 0.170242 -0.323954 -0.391549 0.185237 -0.240268 -0.193535 -0.184841 -0.235073 -0.124557 0.352579 0.297620 0.267898 0.266327 0.262499 0.262934 0.266749
chargesum: 0.00000
title: Mulliken charges with hydrogens summed into heavy atoms:
elementType: Cl O O N N C C C C C C C C C C
charge: -0.037766 -0.256003 -0.262954 -0.180882 -0.009918 0.461797 0.170242 -0.026334 -0.123652 0.185237 0.026058 0.068964 0.078093 0.031676 -0.124557
polarizability: 2.41022860e+02 3.92313755e+00 1.40239888e+02 2.91907695e+00 5.77214922e+00 6.11030534e+01
1716.lowfreq: -9.3441 -3.5146 -1.9389 0.0016 0.0023 0.0026 45.5266 52.8634 81.3153
frequency: 45.4836 52.8571 81.3110 106.9535 156.5073 219.6642 234.2145 272.6037 286.3924 342.1642 388.6698 404.3647 407.6738 443.1105 469.1705 502.5148 524.3348 555.2920 606.9499 618.7132 633.6061 701.1471 708.1995 720.8399 801.0257 817.3368 827.6739 846.4366 860.1181 943.9334 957.1092 982.1596 986.9394 999.5299 1074.8045 1082.5890 1118.6178 1180.7509 1192.9759 1232.2081 1261.5743 1294.9855 1303.9719 1354.7004 1371.2176 1405.1644 1438.7341 1475.9348 1551.9167 1579.9854 1594.8476 1599.3889 1661.6346 3145.9094 3167.1320 3172.2287 3176.4556 3189.5964 3208.6574 3517.7372
redmass: 5.5099 5.6581 6.3921 11.0913 8.7949 9.4109 12.4724 5.6754 5.6041 5.7670 11.4878 5.1763 3.1508 8.2203 6.9852 3.2935 1.4604 4.8825 2.1215 6.9742 7.0515 3.9796 6.9428 6.9135 3.8171 1.2984 1.7954 1.7305 4.9002 1.3311 1.3560 4.2080 1.2852 3.4454 2.6158 2.0306 1.3782 2.2098 1.2180 3.3178 2.9373 1.8167 1.6107 2.1473 5.2866 3.3286 2.0419 2.3832 8.8266 7.7845 6.3914 6.7803 6.7795 1.0897 1.0879 1.0916 1.0960 1.1003 1.0954 1.0790
irintensity: 0.3949 0.3346 1.6813 9.8016 0.1946 1.2806 1.3604 5.0024 1.0313 1.5148 23.2539 7.3415 1.0942 7.7822 22.9590 14.5642 84.1107 13.0952 28.3005 1.7712 2.0040 2.0997 14.2245 13.6060 23.7596 4.4906 48.2665 69.9141 2.8400 0.1840 1.3355 15.7073 1.0740 33.3962 108.2431 7.6266 8.9456 5.3569 1.1073 31.2646 91.2075 13.6324 3.6604 21.4349 9.2365 8.6997 14.6466 184.0001 29.7533 19.2227 233.8122 224.9264 79.9223 3.6808 0.2502 1.5968 0.7867 2.6735 1.2799 44.8947
temp: 298.150 k
press: 1.00000 atm
elementType: 17 8 8 7 7 6 6 6 6 6 6 6 6 6 6 1 1 1 1 1 1 1
symmnumber: 1
zpe: 399903.9 jmol-1
zpe.correction: 0.152315 hartree
zpe.thermalcorrener: 0.164855 hartree
zpe.thermalcorrenthalpy: 0.165799 hartree
zpe.thermalcorrgfe: 0.112228 hartree
zpe.sumelectzpe: -1104.199348 hartree
zpe.sumelectthermal: -1104.186809 hartree
zpe.sumelectthermalent: -1104.185865 hartree
zpe.sumelectthermalfe: -1104.239436 hartree
dipole: 0.2337 -0.0491 0.1644
dipole: 0.2899
quadrupole: -98.7579 -101.9220 -93.4322
quadrupole: -11.2914 3.1936 5.4183
quadrupole: -0.7206 -3.8846 4.6051 -11.2914 3.1936 5.4183
hfenergy: -1104.3516638 hartree
pointgroup: C01 [X(C10H7Cl1N2O2)]
dipole: -0.091864 0.0229851 0.0635786 debye
dipolederiv: -0.9820386 0.0999268 -0.0078845 0.1105241 -0.1142725 0.025434 -0.0080176 0.0206828 -0.066289 -0.4040606 -0.3597088 -0.0553949 0.1612188 -1.0853054 -0.1020634 0.0290169 -0.0995312 -0.3556728 -0.7943859 -0.2253037 -0.026101 -0.7826632 -0.981886 -0.0977159 -0.1198316 -0.1261637 -0.3912193 -0.9368316 0.4506204 0.1113341 -0.044091 -0.4266878 -0.0014798 0.1688531 -0.087394 -0.0696539 -0.6576476 -0.3359958 -0.1067814 0.5422033 -0.2825187 0.0271944 -0.13129 0.0613923 -0.2607552 0.9861051 -0.1841297 0.0153543 -0.0681288 -0.0536824 -0.0719165 -0.0702448 0.0057995 0.0745653 0.458574 0.1904542 -0.0151224 -0.2260218 1.439867 0.1690298 0.00798 0.1440946 0.2478846 -0.1245487 -0.034446 0.0075572 -0.0585381 0.0126782 -0.0533409 -0.0617415 -0.0053563 -0.096522 -0.0634113 0.0090905 -0.0212581 0.0074889 -0.063843 -0.0529065 0.018885 -0.0908811 -0.1106309 1.0771449 0.5512537 0.069035 0.7920934 1.1131138 0.1408532 0.0767744 0.1362141 0.2671715 0.091151 -0.1848089 -0.0335851 -0.0665706 0.0428234 0.0296135 -0.0483866 0.055332 -0.1048873 -0.2525303 0.111996 -0.0456008 0.1243069 0.0018516 -0.0508937 -0.0651879 -0.0262808 -0.0718959 -0.3781798 0.0102652 0.0171356 -0.095624 0.021284 -0.0514921 0.0723197 -0.0670894 -0.0721584 0.1156255 0.0428046 -0.0171797 -0.2412434 -0.1847957 -0.0242582 -0.0460405 -0.0211653 -0.1043284 1.3561418 -0.1525595 0.014263 -0.1061909 0.0662398 -0.0649889 -0.0286258 -0.0495275 -0.04354 0.2274331 0.0053786 0.0282414 -0.0274679 0.1753217 -0.0199161 0.1088787 -0.0066481 0.3060492 0.112416 0.0502057 -0.0206956 0.018735 0.0752744 0.0523406 -0.0272453 0.0176349 0.1436765 0.0310346 -0.0717252 0.0418396 -0.0673901 0.0590817 0.0594353 0.0677481 0.0560593 0.1277065 0.0609721 0.0165952 0.0110157 0.067651 0.0115889 -0.0275647 0.0371251 -0.0178525 0.1538874 0.0328731 -0.0507038 0.0337147 -0.0493805 0.0516112 0.0568735 0.0410696 0.0475261 0.1353155 0.0588 0.0456703 -0.0196013 0.0484363 0.0271997 0.0680509 -0.0222855 0.0627242 0.132533 -0.0146367 0.0151203 0.0197141 -0.0393474 0.0950561 -0.0102885 0.0002465 -0.0095698 0.1587637 unknown
polarizability: 241.1883067|1.4144462|139.8191006|-1.8908447|-7.4196788|61.3583941 unknown
InChI: InChI=1S/C10H7ClN2O2/c11-7-1-3-8(4-2-7)13-10(15)6-5-9(14)12-13/h1-6,12H
charge 0 multiplicity 1
22 atoms
Cl -5.244735 0.502069 -0.047783
O  0.852634 -2.530128 -0.209111
O  3.448105 2.272274 0.362966
N  0.7783 -0.198567 0.103387
N  1.510487 1.009588 0.249062
C  -0.652596 -0.054726 0.050075
C  1.468066 -1.425403 -0.103304
C  -1.499247 -1.066586 0.572862
C  -1.21622 1.119033 -0.517874
C  2.903743 1.143986 0.164074
C  2.93487 -1.30191 -0.225169
C  -2.897846 -0.896058 0.535588
C  -2.615295 1.293395 -0.543983
C  3.609719 -0.116768 -0.128411
C  -3.43946 0.282625 -0.013812
H  0.973912 1.806563 0.604486
H  -1.069968 -1.980387 0.984546
H  -0.578753 1.87993 -0.980154
H  3.448172 -2.248864 -0.417121
H  -3.554753 -1.672664 0.936632
H  -3.051814 2.192967 -0.986311
H  4.696779 -0.048971 -0.226745
