program: Gaussian 09
title: 000229303
version: EM64L-G09RevD.01
frameworkgroup: C1[X(C10H6N4O6)]
method: RPBEPBE
basis: SDD
operation: Freq
keyword: #p
keyword: freq=noraman
keyword: PBEPBE/SDD
title: #p freq=noraman PBEPBE/SDD
converged: NO YES NO NO
title: Mulliken charges:
elementType: O O O O O O N N N N C C C C C C C C C C H H H H H H
charge: -0.219031 -0.244470 -0.162126 -0.185209 -0.193130 -0.184836 -0.168820 -0.363363 0.030915 0.023498 0.355044 0.309090 -0.313225 -0.502970 0.438233 -0.381769 0.195627 0.184015 -0.217635 -0.226915 0.287315 0.335485 0.302065 0.356626 0.273002 0.272585
chargesum: 0.00000
title: Mulliken charges with hydrogens summed into heavy atoms:
elementType: O O O O O O N N N N C C C C C C C C C C
charge: -0.219031 -0.244470 -0.162126 -0.185209 -0.193130 -0.184836 -0.168820 -0.006737 0.030915 0.023498 0.355044 0.309090 -0.025910 -0.167485 0.438233 -0.079704 0.195627 0.184015 0.055367 0.045670
polarizability: 3.00175719e+02 -6.28207699e+00 1.73741215e+02 -4.55117440e+00 1.07649043e+01 8.56560705e+01
1716.lowfreq: -6.6522 -0.0009 -0.0007 0.0000 2.5356 6.0158 43.2366 46.4593 56.0789
frequency: 43.2314 46.4523 56.0769 64.1726 80.6949 124.7234 140.3162 150.8332 165.8241 187.4456 217.7773 273.8518 293.8463 309.1932 338.9189 376.7536 392.1171 432.7023 438.7906 465.2554 496.2153 508.0006 517.7878 567.4289 575.5598 601.2921 625.9473 641.9886 672.2225 696.8355 710.0928 717.8636 733.5343 757.6667 807.2714 834.4577 850.3117 863.4231 885.5283 957.9220 982.4375 990.0929 995.3412 1056.7799 1083.6479 1113.0527 1140.3540 1183.2353 1203.2411 1213.5100 1237.4898 1253.2822 1281.6593 1300.5082 1354.6018 1363.7419 1385.3902 1400.0657 1421.8836 1437.4343 1472.1471 1561.2749 1585.8372 1600.3671 1612.3032 1663.4244 3161.7878 3170.9153 3186.4690 3190.3384 3192.1761 3512.4001
redmass: 8.0304 10.8018 10.2775 13.0428 6.6007 10.9630 8.3322 7.0780 10.7514 8.8741 10.7297 4.8037 7.8803 9.9212 11.4690 7.5930 8.4964 5.1212 6.2084 6.5096 4.4935 2.6535 2.4272 5.2798 5.6107 2.6281 7.0120 6.5829 7.8242 9.2119 6.8823 7.3368 5.3090 12.4062 5.8626 5.4366 1.7271 1.5508 5.8759 1.4448 3.9355 1.2895 1.3496 2.1726 1.8566 4.1602 1.5421 2.5932 10.1575 10.0430 2.5241 1.7816 2.7492 2.4887 1.9859 5.9349 11.2006 7.3269 4.4225 2.2358 3.0355 8.3905 8.9797 7.2923 7.4465 6.9166 1.0904 1.0882 1.0924 1.0960 1.1004 1.0793
irintensity: 1.0394 1.2380 0.3983 0.1236 5.2505 11.5389 0.8744 1.7739 0.8989 2.4007 3.3800 5.3200 1.0134 0.6809 1.0143 7.7375 11.7721 11.0494 15.7121 15.5175 5.9914 24.3031 42.1374 7.9235 6.2027 22.0357 0.8984 5.5597 20.5044 29.3219 13.3181 1.2475 1.8867 21.8243 19.9563 4.2628 56.2551 39.8449 13.3025 22.1277 14.7643 0.2537 1.8890 12.1101 164.0396 9.7696 45.3663 1.3627 451.4556 173.1655 24.2805 64.3106 152.8366 17.8507 17.1559 86.2805 59.2191 50.6285 50.2330 35.8230 81.2508 45.3556 10.8145 168.6917 404.7852 35.1452 0.3941 0.3938 20.5326 6.2263 1.2220 43.4568
temp: 298.150 k
press: 1.00000 atm
elementType: 8 8 8 8 8 8 7 7 7 7 6 6 6 6 6 6 6 6 6 6 1 1 1 1 1 1
symmnumber: 1
zpe: 430222.1 jmol-1
zpe.correction: 0.163863 hartree
zpe.thermalcorrener: 0.180480 hartree
zpe.thermalcorrenthalpy: 0.181425 hartree
zpe.thermalcorrgfe: 0.118395 hartree
zpe.sumelectzpe: -1053.394013 hartree
zpe.sumelectthermal: -1053.377396 hartree
zpe.sumelectthermalent: -1053.376452 hartree
zpe.sumelectthermalfe: -1053.439481 hartree
dipole: 3.0927 -3.2526 0.8178
dipole: 4.5622
quadrupole: -133.8310 -128.6917 -114.6893
quadrupole: 6.7471 11.1897 -2.2693
quadrupole: -8.0937 -2.9544 11.0480 6.7471 11.1897 -2.2693
hfenergy: -1053.5578764 hartree
pointgroup: C01 [X(C10H6N4O6)]
dipole: 1.1568641 -1.3403227 -0.2947007 debye
dipolederiv: -0.3929821 0.1557248 0.2801226 -0.0825292 -0.4580797 -0.2705108 -0.2449596 -0.2376606 -0.8123018 -0.845381 0.1522206 0.1635153 0.4403246 -0.5292594 -0.2385449 0.6614694 -0.3151065 -0.8067968 -0.3881832 0.0235438 0.1734618 0.1494896 -0.6354013 -0.1941954 0.1564094 -0.1058825 -0.3449523 -0.4970347 -0.084511 0.2625551 -0.0809126 -0.539606 0.0211369 0.1741376 -0.0440067 -0.3725578 -0.7988657 -0.2061794 -0.0523048 -0.3710937 -0.6380103 -0.1236862 -0.1048088 -0.1233894 -0.2528173 -0.8873655 0.1426114 0.0497253 0.3080154 -0.5542311 -0.0980756 0.125919 -0.1053373 -0.2393679 -1.4026525 -0.02327 -0.4539832 -0.0255985 -0.1076613 -0.0568432 -0.5264426 -0.1407968 -0.3496036 -0.8501588 0.1199811 0.2697352 -0.3030879 -0.261029 -0.0960346 -0.1977861 0.0280357 -0.1983019 0.711952 0.2208001 -0.4460666 0.0310723 1.3442227 0.2277915 -0.3258919 0.2366968 0.5781829 2.2794454 0.1209757 0.01794 0.1397398 0.9706848 0.2390529 -0.0354608 0.2320116 0.2539218 1.4079285 -0.124945 0.1712558 -0.0494881 0.2049905 -0.0783137 0.2093017 0.0491887 0.0022756 -0.3274465 -0.0861315 0.0377579 0.1571651 -0.2520819 -0.0608561 0.2884691 -0.0672855 0.0370403 -0.5443637 -0.1459972 -0.0621055 -0.3451026 -0.0501171 0.0102764 -0.3012974 0.0064059 -0.1406422 0.2140338 0.0858557 0.0140107 0.1946088 -0.0336291 0.016835 0.0231368 -0.0296372 -0.0416391 -0.9996351 -0.0682466 -0.0364623 0.0416534 -0.074977 -0.0295922 0.0155723 -0.0329911 0.0638514 0.4762809 0.0852318 0.0385797 -0.2550622 0.0078862 0.0258442 -0.0845162 0.0257507 -0.0860706 0.8409122 -0.1522163 -0.1025959 0.3240129 0.4828222 0.4928079 0.4839009 0.3911276 1.1045106 1.3137834 -0.3323 -0.3976397 -0.5140613 0.5167386 0.3947546 -0.4866035 0.3960379 0.8807733 -0.0521848 0.0719207 0.1454653 0.045126 -0.0828087 0.0508364 0.1419237 0.0500767 0.0333506 0.1739109 -0.055991 -0.0135908 0.0282692 -0.1085543 -0.0524526 0.0851441 -0.0494123 -0.1743162 0.0422698 0.0597145 0.0169469 0.0654683 0.0445485 -0.0231183 -0.0249147 -0.0269992 0.1432036 0.1584588 0.016596 -0.0101777 -0.0098855 0.1455642 -0.0095876 -0.0044856 -0.0030392 0.1710996 0.1222309 -0.0395255 -0.0115575 -0.0155718 0.0912639 -0.0203991 0.0560468 -0.0244411 0.1646204 0.1767847 0.0383606 -0.0063913 0.1030776 0.2493153 -0.044634 -0.0463989 -0.0344135 0.2257505 0.0636062 0.0097381 -0.0162845 -0.0113506 0.1292669 -0.0570606 -0.0628438 -0.0456054 0.0514713 0.0046558 0.0160383 -0.0319119 0.0357213 0.1381424 -0.0254308 0.024979 -0.0293271 0.1093157 unknown
polarizability: 299.2601148|-8.7160293|149.257797|-9.8740092|41.6286315|111.0550927 unknown
InChI: InChI=1S/C10H6N4O6/c15-9-3-4-10(16)12(11-9)7-2-1-6(13(17)18)5-8(7)14(19)20/h1-5,11H
charge 0 multiplicity 1
26 atoms
O  1.477663 0.870803 2.048525
O  4.064119 -1.77293 -1.992386
O  -0.927398 3.062973 1.103404
O  0.81628 2.54463 -0.273633
O  -4.78818 -1.72033 -0.428915
O  -4.958337 0.457315 0.243544
N  1.434014 -0.214202 -0.023505
N  2.136011 -0.939524 -1.021971
N  -0.25566 2.246333 0.375202
N  -4.27667 -0.582461 -0.097324
C  0.012616 -0.254925 -0.103354
C  -0.807063 0.872241 0.197912
C  -0.621737 -1.481118 -0.440204
C  -2.207601 0.764854 0.224796
C  -2.796457 -0.467389 -0.109248
C  -2.020557 -1.593547 -0.459851
C  2.115887 0.284836 1.128553
C  3.51916 -1.195872 -1.006741
C  3.562283 0.005323 1.166079
C  4.215859 -0.70455 0.19815
H  -0.001974 -2.360757 -0.639208
H  -2.82494 1.630163 0.480097
H  -2.517297 -2.535268 -0.706123
H  1.645469 -1.047274 -1.915889
H  4.075561 0.395633 2.04961
H  5.288449 -0.911858 0.247982
