program: Gaussian 09
title: 000229301
version: EM64L-G09RevD.01
frameworkgroup: C1[X(C13H17NO2)]
method: RPBEPBE
basis: SDD
operation: Freq
keyword: #p
keyword: freq=noraman
keyword: PBEPBE/SDD
title: #p freq=noraman PBEPBE/SDD
converged: YES YES NO NO
title: Mulliken charges:
elementType: O O N C C C C C C C C C C C C C H H H H H H H H H H H H H H H H H
charge: -0.422476 -0.221512 -0.464250 0.259499 -0.440862 -0.556457 -0.431701 -0.440578 0.137456 0.452855 -0.521915 -0.472503 0.455387 -0.195251 -0.410106 -0.818861 0.226630 0.231908 0.261909 0.218095 0.209077 0.237267 0.228712 0.215666 0.299035 0.244312 0.217203 0.376968 0.218090 0.228360 0.221775 0.230259 0.226008
chargesum: 0.00000
title: Mulliken charges with hydrogens summed into heavy atoms:
elementType: O O N C C C C C C C C C C C C C
charge: -0.045509 -0.221512 -0.165215 0.259499 0.017676 -0.076453 0.014643 0.003800 0.137456 0.452855 -0.277603 -0.255300 0.455387 0.022840 -0.181746 -0.140819
polarizability: 1.95641466e+02 2.76032320e+00 1.52661336e+02 1.02970679e+00 -4.47752845e+00 1.05671538e+02
1716.lowfreq: -31.8459 -0.0009 -0.0007 -0.0003 5.5043 9.2631 15.5857 25.4485 41.0548
frequency: -31.8291 25.0141 41.0508 52.0392 88.7483 101.8030 124.5860 185.8499 207.0185 209.3031 254.0162 283.0932 301.8405 353.7324 365.5829 405.6994 444.8759 447.2429 516.2217 543.5360 552.9535 572.9815 592.9288 634.2775 659.9501 681.4941 694.5281 726.6069 748.2865 780.3554 787.1203 830.0104 856.1856 871.9319 883.5174 911.4555 935.2889 961.6058 974.9934 980.9073 981.1073 1013.7162 1033.2533 1044.6781 1047.8074 1067.1574 1095.0437 1104.7997 1142.2955 1179.7456 1186.4170 1200.2961 1214.2089 1218.8886 1238.1090 1273.2782 1280.3914 1300.4023 1312.4723 1313.4338 1321.0270 1330.0433 1383.4480 1395.2726 1432.2440 1458.9040 1465.0679 1470.5126 1472.8348 1476.0958 1489.7907 1492.5335 1510.7478 1599.0315 1623.2877 1645.8353 2974.6850 2995.9129 3004.8069 3015.3212 3026.3459 3053.8606 3058.4902 3072.4597 3081.3604 3083.9355 3107.4453 3109.9518 3125.6983 3149.5494 3159.9721 3492.0173 3539.8790
redmass: 1.0375 8.3835 4.2495 4.4129 3.4720 1.9937 3.2660 4.3710 2.9571 2.9262 3.2271 3.2287 3.7413 2.3322 3.1383 1.8208 2.6586 3.5863 5.0105 2.6269 2.5326 3.5253 5.7818 2.0014 2.4352 2.8762 1.8950 3.8599 3.7696 1.5846 1.4964 1.7272 1.3281 1.5895 2.6814 2.5625 2.5329 1.3252 2.1128 2.3972 2.9001 1.7822 1.9944 1.5556 1.7061 3.0160 1.6829 3.0725 2.4205 1.0952 1.4478 1.5850 1.7796 1.4666 1.2042 1.4647 1.4591 1.8076 1.5118 1.5434 1.3648 1.7678 4.7790 1.2989 2.5462 1.0835 1.4898 1.0557 1.0917 1.0797 1.4755 1.1000 1.9366 5.2485 6.1087 8.8912 1.0372 1.0612 1.0617 1.0637 1.0668 1.0972 1.0992 1.1025 1.0990 1.1033 1.1012 1.0867 1.0904 1.0983 1.0910 1.0638 1.0762
irintensity: 0.5148 2.0847 0.4062 0.1716 0.1629 0.0440 0.0141 0.6534 3.6732 4.3775 1.4649 3.1927 0.2500 20.3823 1.9776 75.2204 8.3986 10.8875 0.1832 19.2578 38.2595 12.8268 4.2047 48.4485 69.7052 10.3118 27.0079 8.3936 3.5902 63.3270 1.5521 0.9965 5.9386 9.3060 0.7835 2.1070 6.5150 0.8357 5.0401 22.7112 23.5299 35.5524 118.4936 8.5086 43.2151 3.4081 3.8087 10.6175 9.6606 7.1135 0.4531 6.5988 20.9312 10.8152 4.4724 4.0916 1.7075 18.1391 1.7822 18.8291 6.9259 65.0689 33.5137 14.4516 39.2552 5.6723 2.2396 12.5769 11.4537 7.4004 74.8070 3.4074 88.6718 47.1871 206.3935 166.8068 36.9623 20.1934 27.8783 51.9885 24.6897 22.3058 18.3791 5.7269 21.8421 44.9522 25.0662 10.1883 22.5424 39.8189 2.3896 17.5890 19.1496
temp: 298.150 k
press: 1.00000 atm
elementType: 8 8 7 6 6 6 6 6 6 6 6 6 6 6 6 6 1 1 1 1 1 1 1 1 1 1 1 1 1 1 1 1 1
symmnumber: 1
zpe: 720477.9 jmol-1
zpe.correction: 0.274416 hartree
zpe.thermalcorrener: 0.289351 hartree
zpe.thermalcorrenthalpy: 0.290295 hartree
zpe.thermalcorrgfe: 0.231286 hartree
zpe.sumelectzpe: -709.591950 hartree
zpe.sumelectthermal: -709.577015 hartree
zpe.sumelectthermalent: -709.576071 hartree
zpe.sumelectthermalfe: -709.635080 hartree
dipole: -1.7575 0.5894 -1.0471
dipole: 2.1290
quadrupole: -89.0573 -84.6853 -102.9285
quadrupole: 1.5384 2.3859 4.0536
quadrupole: 3.1664 7.5384 -10.7048 1.5384 2.3859 4.0536
hfenergy: -709.8663659 hartree
pointgroup: C01 [X(C13H17N1O2)]
dipole: -0.6495311 0.0684005 0.5244152 debye
polarizability: 193.8847294|-10.0489263|138.2890825|-7.2818458|-21.7538135|121.8005273 unknown
InChI: InChI=1S/C13H17NO2/c1-10-5-4-6-11(9-10)14-13(12(15)16)7-2-3-8-13/h4-6,9,14-15H,2-3,7-8H2,1H3
charge 0 multiplicity 1
33 atoms
O  -1.641011 -1.944366 0.217433
O  -1.655115 -1.004949 -1.897891
N  -0.205913 1.189666 -0.465184
C  -1.406197 0.520545 0.052397
C  -1.505354 0.448887 1.606222
C  -2.664671 1.37622 -0.303644
C  -3.027784 0.383475 1.934919
C  -3.774498 0.853119 0.640216
C  -1.577159 -0.851469 -0.660222
C  1.120287 0.724343 -0.375291
C  1.491063 -0.43054 0.37189
C  2.140215 1.456885 -1.048664
C  2.841692 -0.844022 0.458616
C  3.482888 1.043191 -0.963656
C  3.844069 -0.098028 -0.212362
C  3.212003 -2.087277 1.252738
H  -1.053292 1.381793 1.989391
H  -0.956239 -0.397926 2.04317
H  -2.924793 1.308977 -1.374423
H  -2.417766 2.428986 -0.063696
H  -3.266769 1.028501 2.798848
H  -3.325032 -0.64508 2.201201
H  -4.306067 0.004607 0.171562
H  -4.52906 1.631323 0.847948
H  -0.380588 1.87364 -1.203306
H  0.728517 -1.021311 0.887471
H  1.873809 2.347775 -1.631766
H  -1.733193 -2.780151 -0.31799
H  4.25491 1.619161 -1.487183
H  4.893064 -0.409963 -0.149458
H  2.351261 -2.478141 1.822543
H  3.567957 -2.895466 0.585344
H  4.026767 -1.876603 1.97013
