program: Gaussian 09
title: 000229290
version: EM64L-G09RevD.01
frameworkgroup: C1[X(C9H17NO3)]
method: RPBEPBE
basis: SDD
operation: Freq
keyword: #p
keyword: freq=noraman
keyword: PBEPBE/SDD
title: #p freq=noraman PBEPBE/SDD
converged: YES YES NO NO
title: Mulliken charges:
elementType: O O O N C C C C C C C C C H H H H H H H H H H H H H H H H H
charge: -0.249491 -0.261173 -0.291052 -0.363159 -0.333299 -0.394978 -0.356151 -0.132952 0.231755 -0.688434 -0.703078 0.323012 -0.750365 0.192661 0.213027 0.252968 0.209040 0.213782 0.192204 0.252292 0.348967 0.208947 0.217414 0.210034 0.221104 0.257980 0.222152 0.249112 0.257435 0.250246
chargesum: 0.00000
title: Mulliken charges with hydrogens summed into heavy atoms:
elementType: O O O N C C C C C C C C C
charge: -0.249491 -0.261173 -0.291052 -0.014192 0.072390 0.067029 0.049836 0.119339 0.231755 -0.052040 -0.001842 0.323012 0.006429
polarizability: 1.28199663e+02 -7.06156230e+00 1.22786129e+02 -7.77779784e+00 1.96321324e+00 9.30905404e+01
1716.lowfreq: -15.7043 -7.4972 -0.0011 -0.0007 -0.0004 3.0983 5.7853 23.4214 38.9452
frequency: -15.4524 21.6821 38.8888 56.1923 78.2452 85.1161 113.4856 136.8888 172.4532 189.1927 206.0721 233.5221 256.0417 265.0689 289.7412 310.3852 358.5845 413.8352 474.0930 518.8139 568.8006 581.2942 639.8898 717.5291 734.6480 749.7089 788.7641 797.5813 843.6214 872.0251 906.7494 952.7721 975.3478 1002.9620 1012.7743 1040.9997 1046.9208 1071.8165 1084.6399 1119.1778 1137.6795 1162.7282 1205.9261 1224.7601 1230.8526 1264.4033 1293.5313 1306.5622 1314.9643 1328.3212 1352.0080 1365.2886 1385.6528 1387.9305 1397.1960 1455.1457 1455.8619 1456.9703 1457.5400 1460.2267 1465.4425 1475.1751 1477.9516 1486.5355 1515.9553 1607.7366 1637.0139 2963.4263 2971.9297 2974.8261 2986.8245 3007.3477 3008.5054 3008.6673 3022.2361 3040.6814 3068.7635 3072.8460 3075.7428 3095.9692 3103.9377 3123.7458 3142.2286 3436.6124
redmass: 1.0912 3.4608 3.3564 6.7103 1.6925 3.4026 4.5278 3.4978 2.0933 1.5137 2.7866 1.1658 2.4017 3.5068 4.1041 3.9964 3.4240 3.1927 3.1165 2.7758 3.9766 3.8675 3.5970 3.0351 1.3866 1.2084 3.2960 1.9113 1.8406 2.0603 5.0962 1.8227 1.5755 1.7833 1.7963 3.2537 1.6268 1.6245 2.6758 1.9894 2.0799 2.6474 2.8895 1.9560 1.4701 1.2931 1.1171 1.2742 1.2177 1.6976 1.4708 1.3900 1.2207 1.2136 1.2458 1.0720 1.0454 1.0780 1.0490 1.0970 1.0486 1.0578 1.0430 1.0816 1.7232 9.8234 6.1987 1.0592 1.0390 1.0580 1.0667 1.0369 1.0590 1.0738 1.0846 1.1015 1.1006 1.0994 1.0985 1.0972 1.0993 1.1006 1.1011 1.0799
irintensity: 1.3801 0.1559 0.3600 6.4470 0.3149 3.6196 4.4858 0.1631 4.9114 0.4894 4.2262 0.3324 8.6484 0.8069 9.3885 3.2643 13.6556 6.5595 1.6750 3.8826 0.5281 10.2865 8.6433 6.4145 13.8591 110.5351 3.3391 2.2886 1.9859 13.3011 36.9196 11.7892 12.3285 31.7638 22.5650 5.1903 11.9072 45.9134 0.8738 4.9428 4.0812 10.5179 172.5921 119.8336 11.2713 25.5355 0.0069 4.7468 13.2692 1.9320 0.9047 3.6576 45.8087 16.6935 29.4350 25.4275 11.7785 7.6704 9.1395 24.5406 9.8420 4.8792 9.9857 14.1148 222.4131 71.3672 288.2653 15.8629 22.0889 64.3057 37.2315 12.9693 1.6011 1.8544 12.3588 46.0847 87.3045 41.3746 12.6924 5.3863 19.4329 11.7645 6.7395 95.1256
temp: 298.150 k
press: 1.00000 atm
elementType: 8 8 8 7 6 6 6 6 6 6 6 6 6 1 1 1 1 1 1 1 1 1 1 1 1 1 1 1 1 1
symmnumber: 1
zpe: 664764.7 jmol-1
zpe.correction: 0.253195 hartree
zpe.thermalcorrener: 0.268320 hartree
zpe.thermalcorrenthalpy: 0.269264 hartree
zpe.thermalcorrgfe: 0.209327 hartree
zpe.sumelectzpe: -632.557658 hartree
zpe.sumelectthermal: -632.542534 hartree
zpe.sumelectthermalent: -632.541590 hartree
zpe.sumelectthermalfe: -632.601527 hartree
dipole: -0.3889 2.6118 1.0663
dipole: 2.8478
quadrupole: -72.4189 -80.5633 -82.8703
quadrupole: 5.7440 2.5592 -8.7413
quadrupole: 6.1986 -1.9458 -4.2528 5.7440 2.5592 -8.7413
hfenergy: -632.8108539 hartree
pointgroup: C01 [X(C9H17N1O3)]
dipole: 0.0990034 0.9443026 0.5947933 debye
polarizability: 125.0334833|-7.2730701|125.2526846|-4.0693333|8.6240323|93.7901648 unknown
InChI: InChI=1S/C9H17NO3/c1-4-5-6-10-9(12)7(2)13-8(3)11/h7,10H,4-6H2,1-3H3
charge 0 multiplicity 1
30 atoms
O  2.063106 0.078775 0.068924
O  0.267513 -2.51795 -1.063964
O  0.716059 1.017538 1.726506
N  -0.745825 -1.218595 0.598296
C  -2.768447 -0.259373 -0.569148
C  -2.129674 -1.466955 0.157934
C  -2.956019 0.988208 0.324689
C  1.711276 -1.317786 0.545669
C  0.344285 -1.740692 -0.064912
C  -3.632058 2.15645 -0.425132
C  2.852459 -2.215339 0.09101
C  1.525576 1.151379 0.76976
C  2.038885 2.471685 0.243888
H  -3.756911 -0.579864 -0.957927
H  -2.148585 -0.003228 -1.451026
H  -2.094734 -2.340019 -0.516262
H  -2.739158 -1.735653 1.043473
H  -1.97412 1.32347 0.715456
H  -3.567573 0.713562 1.209135
H  1.627393 -1.262542 1.647786
H  -0.560809 -0.530052 1.339732
H  -4.629967 1.86204 -0.801635
H  -3.764053 3.035548 0.231904
H  -3.026732 2.471808 -1.296064
H  3.816739 -1.829935 0.462872
H  2.873546 -2.278464 -1.008255
H  2.699727 -3.236631 0.481188
H  1.185741 3.097255 -0.071114
H  2.725547 2.325595 -0.601732
H  2.557013 3.010959 1.056048
