program: Gaussian 09
title: 000229289
version: EM64L-G09RevD.01
frameworkgroup: C1[X(C16H18N2O2)]
method: RPBEPBE
basis: SDD
operation: Freq
keyword: #p
keyword: freq=noraman
keyword: PBEPBE/SDD
title: #p freq=noraman PBEPBE/SDD
converged: YES YES NO NO
title: Mulliken charges:
elementType: O O N N C C C C C C C C C C C C C C C C H H H H H H H H H H H H H H H H H H
charge: -0.262852 -0.285295 -0.154590 -0.474100 0.416876 0.509662 -0.347599 -0.335057 -0.368858 -0.495254 0.253145 0.124777 -0.646852 -0.647507 -0.354751 -0.323658 0.332213 -0.353567 -0.371522 -0.537343 0.235845 0.234906 0.305528 0.211277 0.303320 0.233611 0.232686 0.214229 0.230556 0.229949 0.216059 0.273538 0.210196 0.243578 0.251522 0.224992 0.223980 0.246364
chargesum: 0.00000
title: Mulliken charges with hydrogens summed into heavy atoms:
elementType: O O N N C C C C C C C C C C C C C C C C
charge: -0.262852 -0.285295 -0.154590 -0.170780 0.416876 0.509662 -0.111754 -0.100152 -0.063330 -0.283977 0.253145 0.124777 0.033674 0.029056 -0.081213 -0.113463 0.332213 -0.109989 -0.120000 0.157993
polarizability: 4.28930355e+02 -5.48664852e+00 1.84112856e+02 -2.61052755e+00 2.29184476e+00 9.51170108e+01
1716.lowfreq: -7.7021 -5.8743 -1.2333 -0.0011 -0.0009 -0.0004 21.5677 24.7075 45.7931
frequency: 21.5620 24.7002 45.7898 62.9660 72.7649 85.1671 86.3075 118.2568 136.5602 160.0554 178.3278 204.9857 218.1919 228.1043 238.0236 296.1000 308.7392 332.0374 370.5050 388.2519 413.4627 417.0351 418.5757 471.8765 491.8863 509.7071 524.5605 535.7129 588.9666 621.2918 631.3672 635.0976 676.6708 708.5770 723.6697 750.8388 767.2154 796.2084 815.8204 823.8624 828.1266 839.8513 868.1702 920.1578 944.0058 948.3191 977.1048 979.2483 985.2511 993.4581 1000.2264 1056.3976 1090.1029 1108.7420 1110.8623 1111.9476 1115.6820 1134.7617 1157.4578 1165.1542 1176.1410 1200.8843 1234.9398 1249.8868 1261.1266 1265.6644 1304.1231 1322.0994 1358.1658 1371.6481 1378.9254 1421.2916 1424.7224 1435.5327 1439.0118 1457.9061 1462.9425 1467.1263 1471.9469 1473.3981 1487.8476 1496.1766 1506.4004 1509.7315 1525.7898 1561.0630 1580.6532 1597.5320 1620.5725 1640.5623 2929.7480 2939.2283 2963.7063 2991.3190 2997.1023 3053.5347 3090.7310 3100.9636 3102.9591 3114.2981 3128.1924 3149.8674 3159.4102 3165.3351 3166.5475 3170.2013 3191.2149 3535.4758
redmass: 4.2328 3.6596 4.5182 4.4497 2.8203 2.8041 3.0634 2.6446 3.8701 3.3552 4.1173 1.1158 1.4381 3.4952 1.6844 3.9364 4.5392 6.7244 5.2244 4.6893 2.9504 3.2691 3.6858 3.6769 3.5879 3.3187 2.3049 3.6600 5.7080 1.6023 3.0176 6.8345 4.2042 4.8235 3.5154 4.2472 6.0389 1.3939 1.5256 3.1640 1.5969 1.8598 6.5711 1.3799 3.1368 1.3858 1.3627 1.3087 8.6996 3.0438 2.7506 1.4847 3.4272 1.3172 1.2390 1.2609 1.3469 1.4241 1.3349 1.6868 1.2400 1.1276 2.9669 3.0446 1.9820 2.8354 1.3043 1.6330 3.1867 5.3627 5.8117 3.3686 1.9460 1.1899 1.7390 1.2135 1.0423 1.0506 1.0809 1.0466 1.5689 1.4139 1.2329 1.9912 2.6338 7.5442 4.9554 4.9144 6.4794 6.2838 1.0371 1.0396 1.0327 1.0999 1.1018 1.1042 1.0956 1.0933 1.0897 1.0894 1.0997 1.0876 1.0888 1.0924 1.0945 1.0960 1.0952 1.0756
irintensity: 2.8857 0.1439 0.7535 0.3132 2.2602 4.1280 6.8428 7.2738 4.5931 1.9270 1.6157 0.0636 0.1543 5.4315 1.5165 2.5304 1.2567 0.9108 3.7062 4.8531 0.2470 0.5440 2.3355 2.6055 4.3536 21.2394 31.5099 19.2707 19.4953 34.5094 12.4752 2.0421 27.6473 0.4695 0.1583 15.1199 4.4294 34.2751 9.2659 1.2392 72.9759 57.0985 21.5661 2.4347 30.5031 0.4926 2.1326 5.4894 59.2686 0.1692 15.1014 26.8837 17.2507 1.0557 0.1303 0.5094 19.2425 8.6065 0.3160 20.5458 203.8029 14.6992 206.7877 127.8584 11.3635 34.5087 2.5607 138.3487 171.4623 33.2401 20.7418 24.3718 13.4523 15.7976 10.5240 35.2071 0.6288 15.7153 84.8994 20.9011 247.0928 61.1269 40.0881 69.3288 509.4072 91.7509 29.2901 98.2225 95.9112 170.1218 127.5860 144.3775 81.1800 30.1813 71.8833 45.8045 4.6589 62.9828 13.1780 19.7392 26.7999 4.6905 16.8642 18.3427 8.8667 11.6081 9.0153 7.8826
temp: 298.150 k
press: 1.00000 atm
elementType: 8 8 7 7 6 6 6 6 6 6 6 6 6 6 6 6 6 6 6 6 1 1 1 1 1 1 1 1 1 1 1 1 1 1 1 1 1 1
symmnumber: 1
zpe: 806812.2 jmol-1
zpe.correction: 0.307299 hartree
zpe.thermalcorrener: 0.326751 hartree
zpe.thermalcorrenthalpy: 0.327695 hartree
zpe.thermalcorrgfe: 0.257580 hartree
zpe.sumelectzpe: -878.995513 hartree
zpe.sumelectthermal: -878.976061 hartree
zpe.sumelectthermalent: -878.975117 hartree
zpe.sumelectthermalfe: -879.045232 hartree
dipole: 0.8484 -2.2474 0.7218
dipole: 2.5083
quadrupole: -60.4082 -114.1242 -124.5738
quadrupole: -8.0301 -3.6810 0.9602
quadrupole: 39.2939 -14.4221 -24.8717 -8.0301 -3.6810 0.9602
hfenergy: -879.3028119 hartree
pointgroup: C01 [X(C16H18N2O2)]
dipole: -0.3377326 0.8798877 0.2925795 debye
polarizability: 428.8865836|-5.0756576|184.138207|5.2305651|-1.1846763|95.1354307 unknown
InChI: InChI=1S/C16H18N2O2/c1-18(2)14-8-6-13(7-9-14)17-16(19)12-4-10-15(20-3)11-5-12/h4-11,17H,1-3H3
charge 0 multiplicity 1
38 atoms
O  6.342384 0.880428 0.032141
O  0.528214 -1.964829 -0.116352
N  -5.828648 0.072633 0.012337
N  -0.128043 0.280016 0.089212
C  -4.427266 0.107123 0.029964
C  -1.549528 0.168667 0.065299
C  -3.648268 -1.080993 -0.136474
C  -3.714674 1.333834 0.216775
C  -2.242334 -1.057268 -0.118554
C  -2.309793 1.355653 0.232195
C  2.258944 -0.266874 -0.014167
C  0.826287 -0.72846 -0.025843
C  -6.526711 -1.204339 -0.167926
C  -6.59433 1.312102 0.172814
C  3.249364 -1.235677 0.280831
C  2.681545 1.060476 -0.310191
C  5.01728 0.42822 0.032418
C  4.618081 -0.904011 0.312163
C  4.042439 1.408048 -0.287056
C  7.394393 -0.095086 0.335003
H  -4.141976 -2.0458 -0.282743
H  -4.254234 2.275246 0.351046
H  -1.667903 -1.977328 -0.240337
H  -1.7968 2.316469 0.376868
H  0.225956 1.224379 0.253022
H  -6.272213 -1.93031 0.631738
H  -6.28427 -1.676363 -1.142791
H  -7.614888 -1.035465 -0.135816
H  -6.35575 2.051292 -0.620162
H  -6.403824 1.795332 1.154172
H  -7.671411 1.08922 0.111075
H  2.916241 -2.259789 0.478392
H  1.960371 1.832624 -0.606272
H  5.353839 -1.677899 0.549635
H  4.377421 2.422098 -0.524552
H  7.405535 -0.916575 -0.406987
H  7.272821 -0.513825 1.352628
H  8.335045 0.471432 0.276297
