program: Gaussian 09
title: 000229280
version: EM64L-G09RevD.01
frameworkgroup: C1[X(C18H19NO2)]
method: RPBEPBE
basis: SDD
operation: Freq
keyword: #p
keyword: freq=noraman
keyword: PBEPBE/SDD
title: #p freq=noraman PBEPBE/SDD
converged: YES YES NO NO
title: Mulliken charges:
elementType: O O N C C C C C C C C C C C C C C C C C C H H H H H H H H H H H H H H H H H H H
charge: -0.241967 -0.268805 -0.144742 -0.531937 -0.374734 -0.366823 0.205788 -0.296397 -0.303181 0.479617 0.519832 -0.425717 -0.328555 -0.383999 -0.461336 -0.225069 -0.241088 -0.241831 -0.229001 -0.244987 -0.244038 0.214559 0.230940 0.239437 0.265247 0.226624 0.207408 0.221393 0.223854 0.201287 0.234820 0.242672 0.263263 0.220471 0.226614 0.222611 0.228556 0.222782 0.230527 0.225905
chargesum: 0.00000
title: Mulliken charges with hydrogens summed into heavy atoms:
elementType: O O N C C C C C C C C C C C C C C C C C C
charge: -0.241967 -0.268805 -0.144742 -0.317378 0.095644 0.125047 0.205788 0.132405 0.121960 0.479617 0.519832 -0.190897 -0.085883 -0.120736 -0.240866 0.001545 -0.018477 -0.013275 -0.006220 -0.014460 -0.018133
polarizability: 2.20607359e+02 1.85220120e+01 1.91897954e+02 -2.54215313e+00 -4.02037715e+00 1.80843837e+02
1716.lowfreq: -10.7687 -9.3423 -4.2260 0.0004 0.0008 0.0009 18.6179 25.9575 36.5691
frequency: 18.0955 25.7930 36.4661 43.8961 56.8564 63.6827 82.1999 135.0587 161.4982 210.5005 221.5871 244.3443 279.0220 281.0468 301.0391 351.5685 395.6869 402.4410 403.7994 432.1782 449.2607 477.6799 500.0455 551.9105 568.1311 609.7232 615.9902 618.3698 637.1009 688.4754 699.5007 707.1892 747.5749 755.1644 792.8211 820.5849 828.0586 836.1992 842.7107 859.1328 864.6849 898.9695 916.1273 927.3144 948.1941 966.9554 983.1064 989.5276 990.5765 991.9148 999.6336 1009.3466 1021.7812 1027.8908 1028.0660 1048.9396 1069.1692 1079.0389 1087.0884 1104.4036 1170.8053 1172.8160 1177.9861 1178.5468 1188.6853 1192.6867 1192.8112 1196.1998 1213.2397 1250.9943 1257.0019 1274.1709 1278.7579 1325.8608 1332.2633 1339.4427 1341.1549 1351.8216 1365.5529 1379.7112 1388.8741 1408.0727 1439.8796 1443.6609 1444.3609 1447.6375 1453.5727 1456.4466 1479.9988 1482.2015 1577.3715 1592.9586 1595.3731 1608.6270 1614.1481 2954.6710 2958.7410 2981.4180 2989.5664 3002.1658 3083.2054 3085.3311 3088.8905 3103.9476 3107.3151 3114.3973 3122.4403 3125.2923 3134.8686 3138.8826 3145.3239 3155.7477 3163.3872 3170.3934
redmass: 5.6504 3.7721 4.0513 3.5662 4.9474 4.9340 4.6235 6.4941 3.7262 3.1974 4.1357 4.2440 3.1227 4.2353 3.4955 5.7169 1.9163 2.8016 2.8190 4.7278 3.1438 3.4620 3.8676 4.5044 3.4784 3.3515 5.7613 5.5804 3.9341 6.1913 1.6879 1.7861 2.4448 1.8850 4.0433 3.0284 1.9542 3.6157 1.2743 1.2530 3.5307 2.4629 1.6567 1.5978 2.7418 1.3946 1.3883 2.6441 2.5344 3.0320 1.3372 2.4159 2.6001 2.1601 2.2570 2.2216 3.6352 1.6206 1.5997 2.1746 1.0673 1.0884 2.0734 3.0959 1.1268 1.1038 1.1216 1.9723 2.0686 1.5225 1.6061 1.2116 1.4735 1.2475 1.2782 1.2441 1.3024 1.3116 1.3375 7.9349 5.6189 2.4002 2.1529 1.8080 1.0953 1.1670 1.1244 1.1082 2.2317 2.2685 7.9556 6.0382 5.9941 6.0067 6.1763 1.0677 1.0678 1.0670 1.0643 1.0829 1.0967 1.0963 1.0995 1.0939 1.0880 1.0876 1.0865 1.0865 1.0911 1.0924 1.0959 1.0972 1.1014 1.0979
irintensity: 0.1588 0.0313 0.0849 0.1890 0.9137 2.4065 1.3872 1.0201 2.7090 3.1608 3.3186 0.9237 10.4836 0.4636 5.6720 9.0786 1.5225 0.2033 0.2042 3.3328 1.2015 6.5872 6.4954 5.0312 27.1976 13.0229 3.6094 11.0598 11.3869 4.2107 45.9559 63.8629 35.5070 38.2851 6.3663 11.9167 0.1998 0.6598 0.1770 0.0919 3.4676 4.9749 2.8844 4.0046 6.3296 0.2413 0.0380 0.6566 1.7147 0.9661 0.0772 11.8610 38.6916 18.9308 11.4160 35.4807 32.0813 1.2067 17.2549 12.5943 0.0312 0.9826 17.5729 0.9645 0.8195 1.3439 4.7892 71.4304 72.0418 5.8456 19.5227 19.9165 42.8499 1.6559 1.2021 6.2753 1.7937 1.7124 2.9373 0.8134 4.0746 93.6678 8.5406 12.5477 9.0120 8.5629 27.5158 4.3881 30.4461 7.5052 220.5486 19.5376 0.9732 12.6486 6.4186 36.4462 44.1614 33.8302 67.1267 22.1208 34.9856 15.1642 33.9996 14.7240 10.8437 7.5642 0.7732 0.8372 7.5386 30.6652 28.4341 44.9707 26.1787 7.4290
temp: 298.150 k
press: 1.00000 atm
elementType: 8 8 7 6 6 6 6 6 6 6 6 6 6 6 6 6 6 6 6 6 6 1 1 1 1 1 1 1 1 1 1 1 1 1 1 1 1 1 1 1
symmnumber: 1
zpe: 860981.0 jmol-1
zpe.correction: 0.327930 hartree
zpe.thermalcorrener: 0.346158 hartree
zpe.thermalcorrenthalpy: 0.347102 hartree
zpe.thermalcorrgfe: 0.278691 hartree
zpe.sumelectzpe: -900.988271 hartree
zpe.sumelectthermal: -900.970044 hartree
zpe.sumelectthermalent: -900.969099 hartree
zpe.sumelectthermalfe: -901.037510 hartree
dipole: 0.6982 1.7208 2.0874
dipole: 2.7939
quadrupole: -128.7958 -119.8272 -114.1822
quadrupole: 0.4383 -3.5687 -3.9734
quadrupole: -7.8608 1.1079 6.7529 0.4383 -3.5687 -3.9734
hfenergy: -901.3162014 hartree
pointgroup: C01 [X(C18H19N1O2)]
dipole: -0.2590136 0.602148 -0.8823711 debye
polarizability: 218.4846099|-20.0282437|194.7010263|-1.1679618|3.1946266|180.1635129 unknown
InChI: InChI=1S/C18H19NO2/c20-18(19-11-13-21-14-12-19)17(15-7-3-1-4-8-15)16-9-5-2-6-10-16/h1-10,17H,11-14H2
charge 0 multiplicity 1
40 atoms
O  -4.666352 -0.650977 -0.121587
O  -0.206328 -1.599626 1.536063
N  -1.855373 -1.30384 -0.069458
C  0.426744 -0.335767 -0.491597
C  -2.45512 -0.682628 -1.270548
C  -2.826681 -2.08413 0.735034
C  -0.557238 -1.133638 0.407039
C  -3.687783 0.157802 -0.86293
C  -4.040966 -1.2085 1.093167
C  0.218016 1.179355 -0.307989
C  1.879823 -0.762506 -0.246693
C  0.483883 2.055251 -1.391835
C  2.552083 -0.460031 0.963532
C  -0.203489 1.73271 0.927892
C  2.573836 -1.475623 -1.254907
C  0.331305 3.451703 -1.247712
C  3.890521 -0.863176 1.157068
C  -0.355572 3.130169 1.074446
C  3.915311 -1.879441 -1.064621
C  -0.0900 3.995157 -0.011562
C  4.578538 -1.572721 0.14448
H  0.207428 -0.579392 -1.548652
H  -2.773008 -1.479272 -1.9733
H  -1.731876 -0.02796 -1.778999
H  -2.306053 -2.438527 1.640095
H  -3.162053 -2.957077 0.140928
H  -3.358602 1.020202 -0.24384
H  -4.222291 0.524756 -1.754609
H  -4.8292 -1.804247 1.5815
H  -3.727843 -0.381955 1.766719
H  0.825758 1.640967 -2.348979
H  2.025926 0.08104 1.755123
H  -0.409561 1.068506 1.775704
H  2.062818 -1.721263 -2.195019
H  0.542766 4.114262 -2.094647
H  4.397904 -0.626222 2.099096
H  -0.679555 3.543066 2.036581
H  4.4380 -2.430165 -1.854945
H  -0.208307 5.078392 0.102865
H  5.618488 -1.88296 0.297198
