program: Gaussian 09
title: 000229273
version: EM64L-G09RevD.01
frameworkgroup: C1[X(C6H8N4O2S)]
method: RPBEPBE
basis: SDD
operation: Freq
keyword: #p
keyword: freq=noraman
keyword: PBEPBE/SDD
title: #p freq=noraman PBEPBE/SDD
converged: NO YES NO NO
title: Mulliken charges:
elementType: S O O N N N N C C C C C C H H H H H H H H
charge: 0.292413 -0.205377 -0.273764 0.004628 0.007992 0.044278 -0.605795 0.070575 0.208854 0.164387 -0.739837 -0.430576 -0.819157 0.254500 0.242522 0.254907 0.379274 0.339806 0.282428 0.282753 0.245189
chargesum: 0.00000
title: Mulliken charges with hydrogens summed into heavy atoms:
elementType: S O O N N N N C C C C C C
charge: 0.292413 -0.205377 -0.273764 0.004628 0.007992 0.044278 0.113285 0.070575 0.208854 0.164387 0.012092 -0.430576 -0.008786
polarizability: 2.15793360e+02 3.71087811e+00 1.41145481e+02 3.16641295e-03 -5.04087663e-02 5.44209209e+01
1716.lowfreq: -9.3873 -8.5603 -0.0011 -0.0002 0.0009 4.0150 14.5180 61.0415 85.2250
frequency: 13.8154 61.0012 85.2020 113.5729 144.8383 166.8963 199.2590 231.2354 259.1342 272.4411 299.5218 335.5639 363.1525 397.8816 484.9857 527.3372 564.5156 574.7781 585.2401 603.0875 658.7585 663.1004 692.5223 746.6363 757.2823 787.8005 884.7550 959.3490 981.2249 999.3203 1016.5205 1036.7539 1060.3194 1101.1085 1166.0605 1251.9621 1293.0377 1320.3674 1349.3711 1377.7652 1396.2056 1425.6749 1435.5126 1437.1937 1449.2243 1450.1172 1497.2005 1515.5778 1585.3855 3004.8862 3028.5750 3085.0665 3130.3342 3152.8706 3164.8696 3409.8931 3629.5029
redmass: 6.3553 5.9876 3.4833 1.1269 3.9753 4.4783 6.2675 1.0974 5.4336 8.0741 8.3042 3.9279 3.5721 8.2594 7.8591 8.7753 3.0418 4.3333 5.3846 1.7819 7.4054 3.2007 12.1414 1.1892 10.9785 4.7391 6.3931 2.1985 1.1785 1.4020 3.5836 1.6227 3.0620 2.8177 11.7839 6.9389 6.5378 7.1786 1.1615 4.9850 1.2240 4.7209 1.0522 1.2314 1.0474 1.0592 3.2030 2.2151 3.2123 1.0369 1.0284 1.0951 1.1017 1.1040 1.1058 1.0518 1.0986
irintensity: 1.2843 0.0286 4.1850 1.3105 1.9076 4.2303 0.0453 1.0321 0.0829 0.5495 5.8067 7.9746 11.1208 0.7144 9.3727 2.7857 9.1954 2.3995 3.1602 110.9842 1.8278 53.6010 0.0082 79.9485 4.9327 52.2069 31.2827 11.1139 7.2492 2.9283 8.6337 6.6941 9.8809 8.4798 687.2872 60.9046 1.5079 159.7154 3.0597 14.2980 35.4131 97.3066 17.1157 141.9949 13.3249 46.6717 277.0738 209.6294 604.0089 1.0763 20.1405 4.2406 14.2165 8.9828 9.2292 103.8662 92.2449
temp: 298.150 k
press: 1.00000 atm
elementType: 16 8 8 7 7 7 7 6 6 6 6 6 6 1 1 1 1 1 1 1 1
symmnumber: 1
zpe: 389896.3 jmol-1
zpe.correction: 0.148504 hartree
zpe.thermalcorrener: 0.161448 hartree
zpe.thermalcorrenthalpy: 0.162393 hartree
zpe.thermalcorrgfe: 0.107507 hartree
zpe.sumelectzpe: -999.918933 hartree
zpe.sumelectthermal: -999.905988 hartree
zpe.sumelectthermalent: -999.905044 hartree
zpe.sumelectthermalfe: -999.959930 hartree
dipole: 2.7422 -0.0717 0.0046
dipole: 2.7432
quadrupole: -92.9687 -75.0457 -83.0427
quadrupole: 11.1051 -0.0551 0.0143
quadrupole: -9.2830 8.6400 0.6430 11.1051 -0.0551 0.0143
hfenergy: -1000.0674367 hartree
pointgroup: C01 [X(C6H8N4O2S1)]
dipole: 1.0748546 -0.0522075 0.0820732 debye
dipolederiv: -0.8815235 -0.0734271 -0.0630698 0.2162836 0.0834186 0.0176167 -0.058358 -0.0034326 -0.0552866 -0.7140387 0.2215345 -0.0358673 0.4766573 -0.8246696 0.0299512 -0.0333573 0.0106896 -0.2158272 -0.9116659 -0.2035029 -0.0497876 -0.444906 -0.6476339 -0.0373969 -0.0528613 -0.0187093 -0.2903352 -1.3721312 0.4033366 -0.0835786 0.7827654 -0.8821602 0.0482985 -0.0775654 0.0187222 -0.1790451 -1.4488987 -0.5796639 -0.0994226 -0.3944094 -0.6659456 -0.035802 -0.0959278 -0.0488697 -0.2373701 2.0831549 -0.183796 0.1409436 -0.1841191 1.142307 -0.0054403 0.1416774 -0.0056583 0.215041 -0.6278738 -0.4849557 -0.0075322 -0.4938292 -1.0534373 -0.0430081 -0.0077393 -0.0428521 -0.6185349 -1.3468578 0.2528966 -0.0983807 -0.1584661 -0.6308707 -0.0207756 -0.1053129 0.0106904 -0.0117643 1.2048394 -0.2283123 0.078228 0.2391834 0.7260308 0.0284778 0.0839096 -0.0070234 0.1245487 1.2081991 0.5554034 0.0801918 0.1987452 1.1904241 0.0276156 0.0770285 0.0541863 0.2490464 0.0028246 0.2474774 0.005848 0.118256 -0.3121617 0.0046274 0.0037579 0.0156944 -0.0158523 2.008145 0.0996582 0.149114 -0.4154312 0.8847226 -0.0186302 0.1401798 0.0201711 0.0340867 0.1699348 0.1075341 0.0106212 0.1117565 0.0741335 0.0100075 0.0098006 0.0093524 0.0440528 0.0510844 -0.0005075 0.088422 -0.0090031 0.087135 -0.0030426 0.0634004 -0.0179245 0.0132222 -0.0241843 -0.1593867 -0.0138082 -0.0458029 0.0476387 -0.005005 -0.0114803 -0.0142977 0.1099861 0.0741337 -0.0001746 -0.078405 -0.0074171 0.0866036 0.0050384 -0.0535443 0.0205773 -0.008463 0.2979466 -0.0291619 -0.0059838 0.0663745 0.3423753 0.0043633 -0.0048815 -0.0026123 0.3742653 0.1814779 0.038813 -0.0135536 0.0663068 0.3078906 0.0041187 -0.0132787 0.0021874 0.3672909 0.0835522 0.0120137 0.0655487 -0.0664652 -0.0163537 -0.0816111 0.0463473 -0.0538409 -0.0098745 0.0982475 0.0068398 -0.0514204 -0.0745669 -0.0197142 0.070584 -0.0338791 0.0542648 -0.018558 -0.1363664 -0.0026187 -0.0181076 0.0180875 0.0802672 0.0000126 -0.0179155 -0.0013151 0.129371 unknown
polarizability: 215.0056079|1.954582|141.0021484|12.1269729|1.2989223|55.3520053 unknown
InChI: InChI=1S/C6H8N4O2S/c1-3-4(10(11)12)5(7)9-6(8-3)13-2/h7H2,1-2H3
charge 0 multiplicity 1
21 atoms
S  3.437389 -0.832551 0.283782
O  -2.8945 1.450208 -0.168658
O  -3.238658 -0.792151 -0.217507
N  1.27357 0.841038 0.146868
N  0.879359 -1.560904 0.083401
N  -2.431831 0.243355 -0.145552
N  -1.24374 -2.465181 -0.089421
C  -1.004415 0.010413 -0.038233
C  -0.06455 1.096426 0.049774
C  -0.473579 -1.348071 -0.016121
C  -0.424079 2.561578 0.047314
C  1.671824 -0.46989 0.1575
C  4.162235 0.903461 0.358956
H  -1.10553 2.813767 0.877969
H  0.508258 3.139338 0.132718
H  -0.964362 2.845986 -0.872026
H  -2.26115 -2.348333 -0.164303
H  -0.767807 -3.36669 -0.065801
H  3.777354 1.428687 1.243141
H  3.895656 1.456132 -0.551646
H  5.251254 0.756582 0.428646
