program: Gaussian 09
title: 000229270
version: EM64L-G09RevD.01
frameworkgroup: C1[X(C6H6N4)]
method: RPBEPBE
basis: SDD
operation: Freq
keyword: #p
keyword: freq=noraman
keyword: PBEPBE/SDD
title: #p freq=noraman PBEPBE/SDD
converged: NO NO NO NO
title: Mulliken charges:
elementType: N N N N C C C C C C H H H H H H
charge: -0.434710 -0.022715 0.041188 0.005457 0.253398 0.197690 -0.102317 -0.771447 -0.357187 -0.385054 0.317313 0.239389 0.239376 0.281411 0.246273 0.251935
chargesum: 0.00000
title: Mulliken charges with hydrogens summed into heavy atoms:
elementType: N N N N C C C C C C
charge: -0.117398 -0.022715 0.041188 0.005457 0.253398 0.197690 -0.102317 -0.011270 -0.110914 -0.133119
polarizability: 1.34578385e+02 -2.96124754e+00 8.66372388e+01 1.26923560e-02 -6.81341519e-03 4.18847068e+01
1716.lowfreq: -15.8629 -12.9010 0.0000 0.0007 0.0009 8.0857 80.2055 134.9968 228.7718
frequency: 80.1467 134.9949 228.7653 264.0217 315.5665 424.1459 487.8215 499.1065 612.6431 625.3604 625.7576 660.0747 673.0805 803.1039 815.7413 864.9741 889.6928 936.6945 946.1790 1000.6131 1048.0725 1075.6533 1166.2665 1220.9396 1248.2062 1290.1184 1310.7300 1338.1816 1377.3963 1399.9264 1416.2829 1462.3547 1468.8176 1502.2316 1536.9224 1592.2345 2986.0892 3061.3122 3126.6037 3131.6048 3178.3576 3566.2931
redmass: 1.0520 3.8422 4.4141 3.0551 4.6914 4.3036 4.1239 6.7093 3.4559 8.5655 1.4683 2.8898 6.2842 6.6985 6.2178 6.4550 1.4707 1.4798 2.9250 2.3681 1.5159 3.8575 6.0640 1.8894 4.0950 3.5498 2.5553 3.4596 2.2781 1.2393 1.7243 1.1156 1.0438 5.4770 7.2114 6.4475 1.0399 1.0978 1.0931 1.0963 1.0924 1.0817
irintensity: 0.0111 0.8160 7.9106 1.7671 1.2312 0.3419 3.3277 0.8772 0.0110 2.0882 102.1800 18.0633 2.1636 7.5788 1.2994 15.9131 28.9639 0.5365 3.4371 2.3515 5.2650 9.0397 4.5697 17.5997 17.5115 2.4703 18.5118 120.2028 116.5004 4.8531 15.5085 4.4832 20.0700 83.5832 64.8642 12.7552 17.0977 13.5544 16.8170 3.1809 15.3614 40.4717
temp: 298.150 k
press: 1.00000 atm
elementType: 7 7 7 7 6 6 6 6 6 6 1 1 1 1 1 1
symmnumber: 1
zpe: 313380.2 jmol-1
zpe.correction: 0.119360 hartree
zpe.thermalcorrener: 0.127048 hartree
zpe.thermalcorrenthalpy: 0.127993 hartree
zpe.thermalcorrgfe: 0.086718 hartree
zpe.sumelectzpe: -450.534556 hartree
zpe.sumelectthermal: -450.526868 hartree
zpe.sumelectthermalent: -450.525923 hartree
zpe.sumelectthermalfe: -450.567198 hartree
dipole: -4.4208 5.1035 -0.0012
dipole: 6.7520
quadrupole: -53.9842 -59.3261 -58.7938
quadrupole: -6.9576 -0.0051 0.0008
quadrupole: 3.3838 -1.9580 -1.4257 -6.9576 -0.0051 0.0008
hfenergy: -450.6539159 hartree
pointgroup: C01 [X(C6H6N4)]
dipole: 1.6941382 -2.0460967 -0.0004647 debye
dipolederiv: -0.6933397 -0.0812895 0.0001221 0.0661535 -0.5179163 0.0000653 -0.0000671 0.0000922 -0.2613241 -0.8681079 0.2262779 -0.0000581 0.1360673 -0.4085138 0.0000414 0.0000197 -0.0000617 -0.2731646 -0.4808086 0.0496909 -0.0003463 -0.0022283 -0.334694 -0.0002543 -0.0001181 0.0002607 -0.1997541 -0.5956195 -0.0171844 0.0000468 0.2187158 -0.4392199 0.0003019 -0.0002487 -0.0001664 -0.2074413 0.1037138 -0.2293689 -0.0000123 -0.6787749 -0.2739435 -0.0000092 0.0000873 -0.0001542 0.1417589 0.7671756 0.0758764 -0.0000107 -0.0834966 0.8065769 -0.0001767 -0.0000328 -0.0000629 0.0463864 0.7735614 -0.1490532 -0.000072 0.4266171 0.1877178 -0.0000012 -0.0001305 0.0000899 0.0988209 -0.2286121 -0.0276513 0.0000027 0.0882733 -0.0011696 0.0000197 0.0000556 0.0000411 0.0695962 0.4681029 0.1606984 0.0000672 0.0045912 0.3785422 0.0001326 -0.0001593 0.0000279 -0.0667093 0.4344329 -0.1063781 0.0003702 -0.2403846 0.4003295 -0.0000743 0.0015091 -0.000515 -0.0577656 0.1741759 -0.0109152 -0.0000068 -0.0027968 0.1651536 0.0000138 -0.000026 -0.0000214 0.3533657 0.0048221 0.0150591 -0.0243228 0.0414191 0.0630001 0.1020795 -0.0848593 0.0900979 -0.0267487 0.0047975 0.0150434 0.0243073 0.0414415 0.0628959 -0.102137 0.0848484 -0.0901518 -0.0266702 0.0876799 -0.0065184 0.000003 -0.092291 -0.0280366 0.0000452 0.0000342 0.0000403 0.1355275 0.0867117 0.0069639 -0.0000278 0.000216 -0.1007131 -0.0000646 0.0001331 0.0000202 0.1369977 -0.0386858 0.078749 -0.0000624 0.0764776 0.0399907 0.0000177 -0.0010456 0.0004631 0.1371245 unknown
polarizability: 134.4228537|-4.0250628|86.7927698|-0.0125376|0.0070942|41.8847068 unknown
InChI: InChI=1S/C6H6N4/c1-4-9-5-2-7-3-8-6(5)10-4/h2-3,9H,1H3
charge 0 multiplicity 1
16 atoms
N  1.172728 -1.165509 0.000142
N  1.218916 1.123394 -0.000161
N  -1.242811 1.445875 0.000278
N  -2.552036 -0.638103 0.000082
C  -0.16365 -0.762617 0.000059
C  1.963346 0.00212 0.000067
C  -0.115866 0.679107 0.000093
C  3.4586 -0.048297 0.000032
C  -1.419416 -1.399954 -0.00014
C  -2.403125 0.733129 0.001331
H  1.523008 -2.124059 0.000144
H  3.850516 -0.56902 0.89389
H  3.850464 -0.569468 -0.893587
H  3.846131 0.980551 -0.000233
H  -1.547467 -2.488735 -0.000357
H  -3.331739 1.309484 -0.001038
