program: Gaussian 09
title: 000021728
version: EM64L-G09RevD.01
frameworkgroup: C1[X(C16H26N2S)]
method: RPBEPBE
basis: SDD
operation: Freq
keyword: #p
keyword: freq=noraman
keyword: PBEPBE/SDD
title: #p freq=noraman PBEPBE/SDD
converged: YES YES NO NO
title: Mulliken charges:
elementType: S N N C C C C C C C C C C C C C C C C H H H H H H H H H H H H H H H H H H H H H H H H H H
charge: 0.147351 -0.109972 -0.404778 0.037731 -0.596476 -0.582034 -0.570994 -0.593848 -0.780757 0.402806 0.100651 -0.467445 0.229221 -0.364445 -0.258163 -0.349820 -0.225620 -1.206693 -0.852847 0.363130 0.228359 0.202304 0.256208 0.239133 0.243383 0.202445 0.215689 0.352922 0.208982 0.353784 0.227812 0.270672 0.192951 0.248737 0.267391 0.304088 0.287984 0.227803 0.252559 0.161657 0.165368 0.170532 0.249836 0.243337 0.309068
chargesum: 0.00000
title: Mulliken charges with hydrogens summed into heavy atoms:
elementType: S N N C C C C C C C C C C C C C C C C
charge: 0.147351 -0.109972 -0.100690 0.400861 -0.165813 0.156690 0.200061 0.196730 -0.068397 0.402806 0.100651 -0.200054 0.229221 -0.076461 -0.258163 -0.122017 0.026939 -0.709136 -0.050606
polarizability: 2.77628246e+02 -1.44169700e+01 2.61018304e+02 9.84561133e+00 5.80827161e-01 1.43353503e+02
1716.lowfreq: -9.8196 -9.4216 0.0017 0.0019 0.0021 8.2738 12.3127 42.0982 58.9972
frequency: 8.0530 42.0477 58.9263 74.3892 79.8349 93.3427 102.9679 113.9899 149.1569 165.3006 168.9251 178.8872 179.5586 207.5986 213.0634 228.1454 251.8962 279.2884 285.4116 299.8149 315.6756 323.7325 342.6215 349.2530 375.2025 380.2539 405.3472 419.7940 429.1659 447.1044 448.0633 462.4237 492.8995 508.2381 509.3157 568.1012 592.6920 626.3082 642.7990 643.8402 693.7882 749.7460 768.6759 778.2082 787.8187 800.7995 808.5978 869.8735 881.3056 895.0652 912.5898 919.9443 943.5454 968.0614 978.5121 994.5175 1027.1331 1038.1302 1043.9662 1048.1301 1065.5703 1084.4535 1097.1690 1099.4727 1110.6037 1140.8214 1160.5758 1198.4025 1212.5013 1234.3556 1241.9076 1251.9557 1257.1801 1288.0742 1303.0572 1325.4650 1335.3412 1343.3318 1346.8857 1381.3442 1394.6497 1413.6092 1421.3755 1429.5840 1435.5443 1443.4024 1445.7016 1448.1546 1452.7834 1454.3395 1457.9724 1467.0076 1469.4282 1470.8321 1476.8409 1477.7928 1488.3857 1498.7683 1503.5712 1523.4845 1558.2111 1575.6727 1622.4818 2457.0818 2650.4119 2726.2727 2868.2721 2967.2829 2976.2031 2977.5486 2981.2295 2987.4472 3011.9947 3032.6203 3045.7897 3056.6113 3069.0098 3100.8476 3111.7324 3119.5976 3125.3330 3125.5620 3130.9012 3131.0366 3135.1985 3135.9976 3159.4097 3215.3586 3613.4295
redmass: 3.4779 3.9566 3.8088 3.6875 3.0237 2.9220 2.8775 2.6577 2.3802 1.1412 3.3333 1.5813 1.1737 1.3776 3.5704 1.7861 3.5684 3.2061 1.7220 3.5913 1.8597 2.2999 1.3603 4.5479 1.6495 3.4862 1.7496 1.4984 2.6818 2.6403 1.3873 2.1625 2.7496 1.2839 2.5608 5.0134 2.7899 4.8287 6.1310 4.4398 3.8234 4.3586 3.9372 2.5366 3.2362 2.3825 1.4959 2.8428 4.1130 3.2497 1.4404 1.5923 1.3358 2.4388 1.1743 1.2564 1.2047 1.6838 1.7294 1.4149 2.1170 2.1603 1.5658 1.3599 1.5456 1.3063 2.1543 1.6567 1.4638 1.9410 2.2016 1.8237 1.3349 1.9882 1.7721 1.5880 1.0882 1.1586 1.1283 6.6583 1.2074 2.2797 1.1545 1.1724 1.0987 1.8233 1.2959 1.4626 2.0946 1.1484 1.1196 1.0941 1.0752 1.0650 1.0654 1.0696 1.0760 1.0928 1.0531 1.0496 6.3503 6.0274 6.9435 1.0806 1.0925 1.0716 1.0270 1.0604 1.0428 1.0962 1.0978 1.0294 1.0329 1.0960 1.0637 1.0692 1.0925 1.0985 1.1052 1.1029 1.1034 1.1044 1.0894 1.1023 1.1022 1.0939 1.0964 1.0981 1.0809
irintensity: 1.6865 1.2746 2.4346 0.4550 3.8516 9.0999 16.7383 27.5442 2.1590 4.1170 0.7943 4.2405 6.9906 1.7262 2.5030 5.1463 65.3079 12.3230 45.0758 1.7878 18.2593 19.2803 6.0745 5.8527 23.2434 6.5162 18.1501 10.1720 11.1817 0.1086 16.2062 0.4391 10.8391 84.0674 0.2136 3.7462 17.6752 8.7591 1.3785 8.0147 4.3698 0.9339 10.4581 18.2856 22.5196 29.4856 21.3047 3.6864 6.2107 9.6996 14.8946 3.9019 0.2947 24.1783 3.9745 11.8334 27.1013 17.3422 22.7928 1.4852 17.1302 0.9517 51.4322 2.0967 5.5891 0.0451 11.0974 3.1230 3.8978 1.4343 8.1324 4.6379 5.6362 4.5927 32.7690 1.6763 93.4666 49.2807 1.9086 18.0848 26.0399 10.1323 10.9027 6.0841 14.4968 1.0410 1.6692 14.1531 28.7888 23.5850 53.3753 28.9016 66.3211 14.5575 13.3132 22.8762 3.5070 14.0658 3.0008 21.8971 9.1377 1.8126 1.8741 419.8240 215.5815 542.3629 40.5677 31.4002 32.0832 127.9617 74.2359 62.6451 31.7134 14.7613 13.8938 15.0646 13.6443 12.8223 10.3371 6.2377 22.0564 15.4515 12.2760 17.1376 25.6130 7.4518 14.8389 1.9209 67.2429
temp: 298.150 k
press: 1.00000 atm
elementType: 16 7 7 6 6 6 6 6 6 6 6 6 6 6 6 6 6 6 6 1 1 1 1 1 1 1 1 1 1 1 1 1 1 1 1 1 1 1 1 1 1 1 1 1 1
symmnumber: 1
zpe: 1003021.4 jmol-1
zpe.correction: 0.382031 hartree
zpe.thermalcorrener: 0.404577 hartree
zpe.thermalcorrenthalpy: 0.405521 hartree
zpe.thermalcorrgfe: 0.330366 hartree
zpe.sumelectzpe: -1131.243030 hartree
zpe.sumelectthermal: -1131.220484 hartree
zpe.sumelectthermalent: -1131.219540 hartree
zpe.sumelectthermalfe: -1131.294695 hartree
dipole: -7.2298 7.6407 0.6941
dipole: 10.5419
quadrupole: -100.5732 -122.6873 -128.3753
quadrupole: 5.9127 9.4327 2.2211
quadrupole: 16.6388 -5.4754 -11.1634 5.9127 9.4327 2.2211
hfenergy: -1131.6250611 hartree
pointgroup: C01 [X(C16H26N2S1)]
dipole: -3.4196413 -2.3453247 0.0861722 debye
polarizability: 281.5538594|8.5016934|255.4429395|-16.9650003|-7.0240547|145.0032532 unknown
InChI: InChI=1S/C15H23N2S.CH3/c1-11(17(2,3)4)8-12-10-16-15-7-6-13(18-5)9-14(12)15;/h6-7,9-11,16H,8H2,1-5H3;1H3
charge 0 multiplicity 1
45 atoms
S  4.021739 1.46953 0.307712
N  -3.07892 1.398446 0.273109
N  0.645181 -3.513537 0.056323
C  -1.997444 0.347722 -0.223869
C  -1.662148 -0.678913 0.892629
C  -4.369766 0.762164 0.731085
C  -2.44366 2.246513 1.38798
C  -3.333065 2.389579 -0.869369
C  -2.421198 -0.345824 -1.526808
C  -0.521004 -1.599754 0.519607
C  0.881226 -1.252629 0.323626
C  -0.618742 -2.98108 0.348152
C  1.586298 -2.476881 0.040071
C  1.608935 -0.032329 0.384417
C  3.000509 -0.065964 0.164171
C  2.98008 -2.513422 -0.182328
C  3.678037 -1.29141 -0.11819
C  -0.201722 3.059492 -0.653101
C  3.518539 2.379109 -1.277909
H  -1.140145 1.059807 -0.418175
H  -1.391873 -0.146034 1.823317
H  -2.547632 -1.307123 1.120298
H  -4.178279 0.131834 1.612596
H  -5.075879 1.563653 1.002099
H  -4.795805 0.155574 -0.083759
H  -3.151767 3.051301 1.649115
H  -2.241755 1.619722 2.268918
H  -1.499953 2.647556 0.877715
H  -3.978246 3.196218 -0.482634
H  -2.301802 2.771119 -1.11251
H  -3.826391 1.876697 -1.707087
H  -1.636173 -1.081989 -1.771175
H  -3.374092 -0.90534 -1.445799
H  -2.481439 0.353213 -2.375871
H  -1.495778 -3.622492 0.421032
H  0.84985 -4.4974 -0.100807
H  1.103652 0.920003 0.580435
H  3.508128 -3.449173 -0.396744
H  4.759609 -1.266271 -0.285011
H  -0.494327 4.120041 -0.8461
H  0.215305 2.65523 -1.606675
H  0.629544 3.093067 0.091647
H  3.737168 1.747515 -2.153059
H  4.135415 3.292224 -1.306023
H  2.451291 2.650737 -1.234652
