program: Gaussian 09
title: 000229252
version: EM64L-G09RevD.01
frameworkgroup: C1[X(C14H20N2O8S)]
method: RPBEPBE
basis: SDD
operation: Freq
keyword: #p
keyword: freq=noraman
keyword: PBEPBE/SDD
title: #p freq=noraman PBEPBE/SDD
converged: YES YES NO NO
title: Mulliken charges:
elementType: S O O O O O O O O N N C C C C C C C C C C C C C C H H H H H H H H H H H H H H H H H H H H
charge: 0.928888 -0.243324 -0.467060 -0.481892 -0.432612 -0.459462 -0.535579 -0.524915 -0.246434 -0.584623 -0.444798 -0.096124 -0.160907 -0.113652 -0.042934 -0.143156 -0.412983 -0.048430 -0.223790 -0.240031 -0.327284 -0.435901 0.509016 0.221089 -0.796879 0.324354 0.266010 0.241443 0.238499 0.247694 0.357843 0.230065 0.246864 0.373536 0.363401 0.361474 0.360127 0.276674 0.298610 0.319537 0.230308 0.314225 0.241713 0.273491 0.237910
chargesum: 0.00000
title: Mulliken charges with hydrogens summed into heavy atoms:
elementType: S O O O O O O O O N N C C C C C C C C C C C C C C
charge: 0.928888 -0.243324 -0.093525 -0.118491 -0.071139 -0.099335 -0.535579 -0.524915 -0.246434 -0.226780 -0.130573 0.228231 0.105103 0.127791 0.195565 0.104538 0.063947 -0.048430 0.052884 0.058580 -0.007747 -0.205594 0.509016 0.221089 -0.043766
polarizability: 2.85322760e+02 -3.64967091e+01 2.00806705e+02 -8.07685632e+00 -2.45915241e+00 1.96079529e+02
1716.lowfreq: -85.4989 -6.8698 -6.5110 -3.4074 -0.0014 -0.0004 0.0017 6.5747 9.3807
frequency: -85.4928 5.4342 7.9184 32.4462 39.0982 56.1095 73.6951 77.3957 94.6368 97.1176 109.6499 140.0730 147.0213 162.7442 169.9868 181.0156 195.5638 207.5993 229.6510 254.0949 263.7067 285.4241 304.3152 312.9113 319.5775 337.8367 346.5682 359.9442 374.0811 379.7593 397.1726 412.8138 427.8014 446.7078 460.9361 474.5528 493.0707 499.7399 517.2514 536.6458 558.2185 558.9355 583.1383 619.6026 639.1684 648.5778 660.3947 674.7573 728.6390 764.8894 796.5998 817.8383 830.1968 837.9784 859.6299 878.5264 892.3040 916.7571 927.8131 938.0497 939.9855 950.1902 970.2710 982.7291 984.2555 991.1802 995.1980 999.0667 1019.5067 1029.2148 1032.8399 1053.6746 1056.0970 1085.5017 1092.8133 1119.9016 1136.2337 1160.5738 1181.6465 1188.4369 1217.1617 1224.3174 1247.3054 1254.6537 1263.1892 1273.5774 1287.7734 1296.4497 1313.5996 1316.3778 1329.8517 1333.3557 1354.1229 1360.7021 1369.1504 1370.8912 1377.9851 1378.8832 1392.5270 1405.8692 1413.4801 1447.0332 1467.4303 1469.3448 1477.0690 1505.3511 1596.8025 1601.1996 1640.8613 2964.9132 2981.5214 2989.1952 3000.9670 3015.5854 3015.9014 3043.6508 3074.0465 3105.6385 3122.4222 3138.1853 3157.9367 3163.2972 3199.4528 3281.2750 3396.5655 3521.3895 3544.9939 3573.7982 3581.8741
redmass: 1.0354 6.1342 6.6372 4.6322 6.3544 5.9250 6.4083 4.5552 7.0634 5.5887 5.8980 6.7207 6.3130 5.0237 5.0960 7.5453 4.3761 7.5585 6.4807 4.1048 5.5452 1.3753 3.4756 6.5848 4.5916 1.9336 4.9690 5.0353 2.1545 4.5893 6.3726 2.9904 5.7076 3.3146 2.7593 2.4750 2.8406 3.1756 3.4646 3.6060 4.8120 5.1669 2.9060 6.9482 1.1614 1.1940 4.1871 6.0301 3.3231 6.5859 13.7944 4.6725 3.2985 1.3664 1.5201 2.0508 1.8035 3.1535 6.3301 7.3079 5.5643 6.0875 1.3418 2.2638 3.3991 3.1043 1.3773 4.1009 4.5527 2.7045 1.6698 1.9501 2.3473 1.8305 2.4342 1.3145 2.6335 1.6402 1.1250 1.1064 3.4347 1.2891 1.1748 1.2665 1.8515 1.1719 1.1922 1.4270 1.2577 1.1567 1.1945 1.2826 1.2429 1.2732 3.9075 1.4837 1.5275 1.2556 1.6281 4.9841 1.6318 1.1277 1.0466 1.0852 2.3319 2.0420 6.4780 5.7149 5.1821 1.0816 1.0850 1.0385 1.0830 1.0757 1.0727 1.0877 1.0983 1.1039 1.0898 1.0979 1.0949 1.0916 1.0953 1.0728 1.0660 1.0765 1.0654 1.0661 1.0665
irintensity: 0.0470 0.2773 0.4705 4.5852 0.0019 0.3695 7.4688 2.5597 0.2534 6.0959 2.2454 9.7647 5.9955 5.5753 5.7629 2.3853 19.7794 4.7136 2.2186 11.2135 13.3171 137.0867 45.2240 12.6532 17.2306 53.1747 35.4401 0.8659 78.7412 17.0571 19.6933 0.6894 23.8709 18.2537 93.5508 64.6983 38.1322 40.1680 15.1305 59.3006 22.5648 85.5496 3.2677 4.2350 149.6791 61.3598 16.1073 5.0915 0.4233 17.0089 103.5228 7.8219 29.3420 24.7644 62.1547 21.1721 167.9308 9.1044 5.4752 96.4040 48.0054 70.4292 0.1438 23.4915 34.9850 3.8225 5.7807 61.4242 178.2278 83.1129 8.7305 13.2450 45.9868 22.4020 18.1029 12.3092 1.0494 12.1921 25.3550 41.6319 65.6645 46.3682 23.1476 2.5499 55.6938 23.5545 0.4895 56.6271 5.5083 10.7213 56.4423 17.2835 20.7854 3.2398 217.5972 7.0487 14.5591 79.3910 27.8352 16.3726 13.4741 43.9037 20.7262 7.0439 58.4957 401.5907 98.0953 25.1219 119.0523 4.3718 51.8542 6.7524 1.7493 43.4783 36.2208 29.7860 13.1335 19.6477 14.6675 6.1304 6.2734 2.7306 9.2989 111.1261 165.1574 14.1381 33.5942 11.4907 18.0890
temp: 298.150 k
press: 1.00000 atm
elementType: 16 8 8 8 8 8 8 8 8 7 7 6 6 6 6 6 6 6 6 6 6 6 6 6 6 1 1 1 1 1 1 1 1 1 1 1 1 1 1 1 1 1 1 1 1
symmnumber: 1
zpe: 898349.6 jmol-1
zpe.correction: 0.342163 hartree
zpe.thermalcorrener: 0.367726 hartree
zpe.thermalcorrenthalpy: 0.368670 hartree
zpe.thermalcorrgfe: 0.283076 hartree
zpe.sumelectzpe: -1652.734255 hartree
zpe.sumelectthermal: -1652.708692 hartree
zpe.sumelectthermalent: -1652.707747 hartree
zpe.sumelectthermalfe: -1652.793342 hartree
dipole: -2.8697 8.1943 6.5334
dipole: 10.8659
quadrupole: -124.6959 -171.3540 -151.4950
quadrupole: 10.2429 -17.9537 9.7810
quadrupole: 24.4857 -22.1724 -2.3133 10.2429 -17.9537 9.7810
hfenergy: -1653.0764179 hartree
pointgroup: C01 [X(C14H20N2O8S1)]
dipole: -1.0193419 -3.7611156 -1.7579027 debye
polarizability: 282.7996712|40.0590299|201.9780515|-0.9525877|-3.5367055|197.4312699 unknown
InChI: InChI=1S/C14H20N2O8S/c1-7(18)15-8-2-4-9(5-3-8)25(22,23)16-11-13(20)12(19)10(6-17)24-14(11)21/h2-5,10-17,19-21H,6H2,1H3
charge 0 multiplicity 1
45 atoms
S  0.102054 2.61103 -0.28605
O  1.918085 -1.444008 -0.633263
O  4.15381 1.957221 0.574397
O  5.108859 -0.618879 1.227929
O  2.666965 -0.421406 -2.680969
O  4.36095 -3.285269 1.499907
O  0.345627 3.036281 -1.847569
O  -0.056402 3.706951 0.906425
O  -5.335902 -1.301964 1.917602
N  1.491636 1.481609 0.285873
N  -4.831323 -0.950062 -0.349953
C  2.389676 1.035531 -0.813199
C  3.777502 0.76507 -0.190855
C  3.738474 -0.463518 0.727665
C  3.26263 -1.700871 -0.064209
C  1.856515 -0.252739 -1.481473
C  3.080845 -2.935752 0.833657
C  -1.398876 1.482001 -0.276423
C  -1.965853 1.117679 0.954777
C  -1.933058 1.085656 -1.513105
C  -3.113495 0.299875 0.960963
C  -3.081114 0.272518 -1.504886
C  -3.675034 -0.130211 -0.275183
C  -5.598145 -1.487521 0.696337
C  -6.785321 -2.321156 0.217475
H  2.481287 1.804209 -1.606399
H  4.504931 0.575708 -1.004469
H  3.028507 -0.281007 1.562281
H  3.986905 -1.907411 -0.881758
H  0.7801 -0.169062 -1.716233
H  2.03934 2.094852 0.931852
H  2.686686 -3.788539 0.249942
H  2.379785 -2.709232 1.652485
H  4.953825 1.715869 1.110329
H  5.156357 -1.510497 1.678693
H  2.285837 -1.152586 -3.229251
H  4.923381 -3.815627 0.88216
H  -1.532021 1.473621 1.894202
H  -1.475101 1.429299 -2.446453
H  -3.581476 -0.00758 1.897111
H  -3.522866 -0.044706 -2.457797
H  -5.147903 -1.175812 -1.296407
H  -7.491992 -1.709855 -0.373986
H  -7.312851 -2.716056 1.097133
H  -6.455739 -3.17005 -0.409898
