program: Gaussian 09
title: 000229241
version: EM64L-G09RevD.01
frameworkgroup: C1[X(C20H22O4)]
method: RPBEPBE
basis: SDD
operation: Freq
keyword: #pfreq=noraman
keyword: PBEPBE/SDD
title: #p freq=noraman PBEPBE/SDD
converged: YES YES NO NO
title: Mulliken charges:
elementType: O O O O C C C C C C C C C C C C C C C C C C C C H H H H H H H H H H H H H H H H H H H H H H
charge: -0.226911 -0.234969 -0.280613 -0.265271 -0.381437 -0.382711 -0.527817 -0.530166 0.085037 0.089676 0.341312 0.334397 -0.362528 -0.337042 -0.352905 -0.377425 -0.366077 -0.379287 -0.349660 -0.338382 0.348075 0.342784 -0.545228 -0.557195 0.239951 0.214797 0.241524 0.214719 0.213301 0.236658 0.234807 0.214634 0.241168 0.243979 0.277372 0.270558 0.243154 0.254642 0.251779 0.237926 0.223611 0.232212 0.246386 0.245840 0.220209 0.255116
chargesum: 0.00000
title: Mulliken charges with hydrogens summed into heavy atoms:
elementType: O O O O C C C C C C C C C C C C C C C C C C C C
charge: -0.226911 -0.234969 -0.280613 -0.265271 0.073311 0.073531 -0.077858 -0.080725 0.085037 0.089676 0.341312 0.334397 -0.121360 -0.093063 -0.075532 -0.106867 -0.122923 -0.124645 -0.097880 -0.100457 0.348075 0.342784 0.156981 0.163970
polarizability: 3.12384439e+02 3.64340930e+00 1.45122534e+02 1.66806876e+00 -6.94423311e+00 2.15062095e+02
1716.lowfreq: -8.0590 -5.6577 -0.0005 -0.0003 -0.0002 9.4241 22.1232 24.9523 39.2032
frequency: 21.6975 24.8540 39.1348 46.1703 57.2241 66.2574 77.7107 88.3663 112.5822 132.6090 135.9861 142.8475 157.3717 197.0631 203.2493 229.0257 233.7935 257.0991 259.6442 269.7384 300.4435 315.8416 329.7073 334.3755 410.6675 416.6949 420.2156 441.4971 462.6816 469.6942 503.2934 511.0215 512.6250 533.2806 548.2298 625.2494 626.2254 639.3689 643.7819 669.1082 669.8127 735.0082 751.0134 773.0494 781.5512 797.5362 811.4996 822.3254 824.1421 840.8824 853.4150 904.8142 922.2390 945.6915 965.2572 977.2031 979.6160 980.9868 986.2379 990.4902 998.9872 1002.6857 1018.0827 1023.8015 1080.9038 1087.5890 1111.0372 1113.4291 1114.5962 1120.3611 1136.7828 1149.2297 1155.2437 1158.7695 1173.6024 1179.5781 1208.2326 1229.6092 1239.3404 1254.1083 1285.8501 1288.1649 1297.5744 1300.3673 1312.9125 1317.1813 1327.3524 1366.2825 1373.2231 1377.1790 1425.4572 1428.3627 1436.2317 1440.0790 1457.8300 1459.7874 1461.2044 1468.0389 1472.0931 1473.2602 1474.1224 1477.4178 1496.5867 1499.7839 1553.0689 1553.7334 1582.5147 1589.3889 1617.2310 1620.4377 2963.4899 2966.5855 2983.5626 2987.3620 2995.9293 2998.2849 3032.5569 3054.1096 3057.5889 3057.8921 3069.0697 3072.9384 3127.4343 3127.4895 3141.7201 3142.6545 3143.2064 3149.3225 3164.4995 3165.4456 3170.1014 3170.6695
redmass: 6.5197 5.5659 6.2527 3.6941 3.7713 5.4302 4.4730 5.2520 4.5352 4.4309 3.0436 4.1472 4.1790 3.2436 2.4902 1.4577 1.2795 2.1574 3.4549 2.8034 3.8110 3.8827 5.0180 4.1949 3.0196 2.9696 3.0588 3.6412 4.6251 3.7872 3.3118 3.2069 2.7297 4.7788 4.2339 5.7792 6.4950 3.4959 4.5876 2.7611 2.8871 2.3782 3.7454 3.7159 5.4784 2.4188 1.3880 2.0046 1.2584 1.6381 1.7498 1.8009 2.4810 1.4023 1.3680 5.7544 4.2979 1.6275 2.9943 1.4926 2.8181 2.3304 2.9790 2.1036 2.3392 2.8471 1.2642 1.3229 1.3200 1.2552 1.2777 1.4803 1.3343 1.3209 1.2350 1.2485 1.3803 3.0210 3.1745 2.0199 2.0504 1.9304 1.2928 1.3492 1.3361 1.4215 1.1894 1.8132 3.8703 3.8465 4.3112 3.9856 1.1703 1.2154 1.0928 1.1102 1.0915 1.0500 1.0536 1.1011 1.0756 1.0804 2.4175 2.4453 8.0966 7.9325 7.4752 8.1820 6.4155 6.6059 1.0326 1.0327 1.0601 1.0616 1.0623 1.0618 1.0988 1.1030 1.1041 1.1050 1.0993 1.1003 1.0999 1.1001 1.0876 1.0879 1.0878 1.0879 1.0952 1.0952 1.0973 1.0965
irintensity: 1.8367 0.8446 0.1450 1.1524 0.6324 0.1694 0.0383 0.2131 15.1099 3.2504 7.6355 4.6697 4.4868 1.7931 0.5667 0.6233 0.1995 1.6066 7.1466 0.3650 0.2269 2.7813 0.4979 3.6535 0.1899 0.1414 0.9158 3.8057 0.4249 1.1825 14.0315 11.3161 0.9098 29.6445 20.6922 1.9965 0.9452 10.3319 2.1720 7.4861 16.5131 5.7716 11.2757 2.8440 2.8093 28.4796 26.0084 15.9963 2.9479 135.7196 8.0768 1.1178 0.5600 0.0678 0.5252 102.8610 20.8476 10.4842 16.6030 1.4039 1.1455 2.8140 3.3438 0.1595 2.3212 1.7900 0.8950 8.7914 4.8470 0.8947 32.6067 121.9952 0.3688 2.1668 29.3402 115.1508 0.8354 104.4978 170.9303 4.8199 180.4611 148.1941 1.1481 39.8363 14.3923 6.8516 1.2796 0.8712 24.3252 16.4479 29.1702 0.6849 6.8241 5.2211 22.0079 20.0000 24.5872 13.4996 10.3388 2.3381 48.3228 21.6703 16.1472 19.1133 138.5277 157.0364 124.3504 79.4804 55.3145 181.0611 43.3088 71.9036 1.2264 36.2388 13.4639 40.9529 2.5023 20.9194 39.5516 35.2244 13.9780 86.6987 22.3558 21.4689 6.2357 2.5045 5.9275 0.2167 11.2759 11.4956 4.4475 4.0974
temp: 298.150 k
press: 1.00000 atm
elementType: 8 8 8 8 6 6 6 6 6 6 6 6 6 6 6 6 6 6 6 6 6 6 6 6 1 1 1 1 1 1 1 1 1 1 1 1 1 1 1 1 1 1 1 1 1 1
symmnumber: 1
zpe: 976809.5 jmol-1
zpe.correction: 0.372047 hartree
zpe.thermalcorrener: 0.395370 hartree
zpe.thermalcorrenthalpy: 0.396314 hartree
zpe.thermalcorrgfe: 0.317876 hartree
zpe.sumelectzpe: -1074.440154 hartree
zpe.sumelectthermal: -1074.416831 hartree
zpe.sumelectthermalent: -1074.415886 hartree
zpe.sumelectthermalfe: -1074.494325 hartree
dipole: 4.4417 -0.9051 2.4829
dipole: 5.1684
quadrupole: -120.7731 -148.9015 -148.4232
quadrupole: -1.5833 9.2385 -19.7882
quadrupole: 18.5928 -9.5356 -9.0572 -1.5833 9.2385 -19.7882
hfenergy: -1074.8122009 hartree
pointgroup: C01 [X(C20H22O4)]
dipole: -1.7091885 -0.4922904 -0.9854467 debye
polarizability: 312.2655418|4.2742229|146.1277756|3.0286539|10.854026|214.1757511 unknown
InChI: InChI=1S/C20H22O4/c1-23-17-11-7-15(8-12-17)19(21)5-3-4-6-20(22)16-9-13-18(24-2)14-10-16/h7-14H,3-6H2,1-2H3
charge 0 multiplicity 1
46 atoms
O  2.379553 -1.984991 2.393724
O  2.091146 2.062141 -2.522005
O  -3.300165 -1.936705 -0.608889
O  -3.088456 1.956355 1.344696
C  3.35276 -0.574523 -0.606307
C  3.410665 0.645806 0.340795
C  3.325339 -1.93474 0.155285
C  3.291777 2.007519 -0.40909
C  2.157192 -2.022207 1.143461
C  2.015652 2.093099 -1.253026
C  0.751751 -2.068042 0.624773
C  0.684702 2.124885 -0.569529
C  0.430639 -2.347238 -0.728687
C  0.52589 2.380084 0.823737
C  -0.314354 -1.795611 1.531479
C  -0.477398 1.856586 -1.340843
C  -0.905524 -2.342623 -1.180172
C  -0.741803 2.344818 1.423769
C  -1.644614 -1.7683 1.096617
C  -1.752559 1.797839 -0.752709
C  -1.943441 -2.02998 -0.266663
C  -1.884193 2.027437 0.643061
C  -3.680426 -2.267205 -1.987689
C  -4.288513 1.532865 0.60818
H  2.460338 -0.497652 -1.254541
H  4.230029 -0.563218 -1.282216
H  2.603709 0.567833 1.092313
H  4.363247 0.632862 0.905799
H  3.279014 -2.76021 -0.581634
H  4.252093 -2.058958 0.743315
H  4.143684 2.136456 -1.100151
H  3.327832 2.830161 0.331645
H  1.224264 -2.581023 -1.446065
H  1.396074 2.614721 1.445784
H  -0.060492 -1.593492 2.577067
H  -0.346293 1.680297 -2.414028
H  -1.12033 -2.563163 -2.229687
H  -0.875408 2.535817 2.492583
H  -2.466602 -1.538848 1.781591
H  -2.625861 1.566976 -1.369881
H  -3.211042 -1.574203 -2.712325
H  -3.405204 -3.309308 -2.237747
H  -4.774033 -2.155435 -2.019252
H  -5.089218 1.512126 1.361676
H  -4.545641 2.259467 -0.186375
H  -4.150176 0.52392 0.174665
