program: Gaussian 09
title: 000229232
version: EM64L-G09RevD.01
frameworkgroup: C1[X(C17H19N3O3S)]
method: RPBEPBE
basis: SDD
operation: Freq
keyword: #p
keyword: freq=noraman
keyword: PBEPBE/SDD
title: #p freq=noraman PBEPBE/SDD
converged: YES YES NO NO
title: Mulliken charges:
elementType: S O O O N N N C C C C C C C C C C C C C C C C C H H H H H H H H H H H H H H H H H H H
charge: 0.966538 -0.508128 -0.542231 -0.256714 -0.508678 0.061613 -0.459684 -0.559776 -0.424717 0.519111 -0.065680 -0.229562 -0.193837 0.508964 -0.198584 -0.424612 -0.309568 -0.393181 -0.430159 -0.217662 -0.223748 -0.244919 0.227949 -0.777752 0.221732 0.208444 0.207928 0.237839 0.285063 0.279764 0.211450 0.230965 0.314259 0.225965 0.224672 0.302083 0.251371 0.220028 0.306780 0.216279 0.263501 0.261437 0.215458
chargesum: 0.00000
title: Mulliken charges with hydrogens summed into heavy atoms:
elementType: S O O O N N N C C C C C C C C C C C C C C C C C
charge: 0.966538 -0.508128 -0.542231 -0.256714 -0.206595 0.061613 -0.152904 -0.129600 0.021050 0.519111 -0.065680 0.055501 0.085926 0.508964 0.012866 -0.193648 0.004691 -0.167216 -0.205487 0.033709 -0.003719 -0.028640 0.227949 -0.037356
polarizability: 3.08932453e+02 2.60978369e-01 2.19683481e+02 -5.05324771e+00 -2.48968062e+01 2.01849184e+02
1716.lowfreq: -8.1472 -5.8069 -2.4255 -0.0018 0.0009 0.0011 10.4924 14.8881 20.2536
frequency: 9.8197 13.5652 20.1918 25.7827 36.7627 40.3378 56.9003 66.9814 73.9808 99.1081 102.0085 124.2824 138.1425 168.3471 181.7535 198.9959 214.5802 216.8682 245.7137 273.6534 300.0583 324.1041 340.5874 348.1354 376.4015 395.8984 403.4322 411.8491 412.4767 442.3316 457.4423 487.6912 502.1187 528.1549 546.4139 564.6984 596.4238 616.7125 618.7041 647.3823 673.2503 703.6954 720.4954 728.6784 750.8000 762.0020 811.8477 824.7250 833.5178 853.4180 858.6627 867.4960 874.6450 904.1106 930.3827 942.3965 953.6335 963.9526 972.3924 976.1102 987.7317 989.3336 990.5578 995.1849 997.2067 1020.9024 1028.5144 1039.7343 1057.9629 1068.7571 1098.5241 1122.4964 1171.4545 1184.0336 1187.9011 1191.5978 1198.2854 1214.8402 1217.5714 1260.8521 1264.6100 1298.1958 1303.7998 1327.6843 1336.0066 1373.4029 1374.3931 1382.4446 1390.3649 1407.0588 1439.1184 1447.7869 1449.0669 1468.7237 1470.4704 1476.2110 1484.7255 1500.2332 1593.0597 1595.9064 1602.4069 1603.0966 1614.2722 1627.0172 2975.0696 2982.4985 2990.9251 2996.6311 3034.4994 3073.2319 3096.8187 3101.5352 3112.1026 3112.5527 3124.9638 3126.0180 3142.5769 3158.5757 3165.6106 3173.5075 3204.0448 3262.2085 3533.6484
redmass: 4.6936 4.5231 4.6056 3.3342 2.5952 1.8200 3.5304 6.8962 4.8415 6.2133 4.5010 5.4700 3.6629 7.5418 5.0399 6.6739 5.5433 6.6067 3.4412 4.0023 5.3534 5.9765 2.6198 3.8773 3.3823 3.1989 2.8246 6.9701 3.1629 4.8988 5.2428 3.9770 2.3732 2.7973 4.3987 3.0617 3.1201 6.3606 6.9174 1.2036 5.5341 1.8197 2.6680 3.3170 2.3965 2.0806 10.8744 4.4085 1.4305 1.3098 1.4703 1.6477 1.7236 1.5350 6.2929 2.0943 15.3115 1.3885 3.1315 1.3852 2.2995 2.0282 3.7208 1.8635 1.3166 2.4800 2.1921 1.6398 2.3842 1.9724 1.5871 1.3127 1.0646 1.1238 1.2353 1.2188 1.4935 3.4390 1.6904 1.5242 1.3215 1.3994 1.3495 1.3279 1.3154 3.9625 1.5635 7.4112 1.2338 4.7388 2.1417 1.0455 1.1071 1.1281 1.1270 2.1986 2.2510 2.2858 6.1642 6.7688 6.4383 6.6985 6.1148 4.8088 1.0623 1.0756 1.0731 1.0364 1.1018 1.0974 1.0995 1.0991 1.0859 1.0879 1.0901 1.0907 1.0958 1.1015 1.0952 1.0915 1.0954 1.0748 1.0765
irintensity: 0.7731 0.2314 2.6179 2.3064 0.2627 4.3579 0.8990 2.2244 5.8160 1.2493 2.1914 0.5967 6.4267 3.2403 2.8721 11.6297 5.5744 3.9708 4.9607 7.2057 17.3944 13.1752 8.0496 31.1949 12.7396 32.5732 0.1341 13.4742 2.8206 42.9836 13.3019 16.3792 10.9076 69.9686 43.1360 18.6188 1.2425 0.2625 2.0504 56.9075 2.0858 48.0070 107.9138 7.3301 26.0296 63.9559 94.9169 33.4292 14.6262 16.2645 39.5685 19.2709 45.7427 5.3693 6.7764 6.4292 65.8947 1.1089 4.3034 0.8352 5.5789 5.0357 0.9649 8.6969 0.9796 6.9742 5.3565 16.7151 32.6187 9.1356 8.2139 8.4538 0.8290 23.1871 0.2359 1.7186 0.8511 54.9218 1.3503 60.9626 6.0130 43.0276 0.7469 2.8159 0.4122 231.4085 1.5236 0.3559 44.2415 16.0983 7.7072 15.8370 17.8464 16.9365 10.8213 28.1130 7.5229 369.4358 5.3991 87.2511 11.5152 12.5821 5.1971 102.7086 23.2044 32.8835 83.0958 10.5697 16.8268 24.8422 11.9901 10.8039 4.4558 9.5134 11.7225 20.5818 32.3135 13.5929 5.1787 2.7744 5.4382 3.3156 15.7850
temp: 298.150 k
press: 1.00000 atm
elementType: 16 8 8 8 7 7 7 6 6 6 6 6 6 6 6 6 6 6 6 6 6 6 6 6 1 1 1 1 1 1 1 1 1 1 1 1 1 1 1 1 1 1 1
symmnumber: 1
zpe: 865830.3 jmol-1
zpe.correction: 0.329777 hartree
zpe.thermalcorrener: 0.354302 hartree
zpe.thermalcorrenthalpy: 0.355246 hartree
zpe.thermalcorrgfe: 0.270142 hartree
zpe.sumelectzpe: -1445.248454 hartree
zpe.sumelectthermal: -1445.223929 hartree
zpe.sumelectthermalent: -1445.222985 hartree
zpe.sumelectthermalfe: -1445.308089 hartree
dipole: -4.1700 3.0685 3.8432
dipole: 6.4479
quadrupole: -120.5230 -164.0712 -147.7345
quadrupole: 32.6525 -7.9920 -6.2582
quadrupole: 23.5866 -19.9616 -3.6249 32.6525 -7.9920 -6.2582
hfenergy: -1445.5782309 hartree
pointgroup: C01 [X(C17H19N3O3S1)]
dipole: 0.8957583 -1.8269645 1.5149886 debye
polarizability: 291.1829449|-35.6836588|235.0559412|18.4997976|19.4397206|204.2262321 unknown
InChI: InChI=1S/C17H19N3O3S/c1-14(21)19-16-9-11-17(12-10-16)24(22,23)20-18-13-5-8-15-6-3-2-4-7-15/h2-4,6-7,9-13,19-20H,5,8H2,1H3
charge 0 multiplicity 1
43 atoms
S  -1.097652 3.394712 -0.017809
O  -1.36342 3.801863 -1.568558
O  -1.051809 4.508787 1.167446
O  3.514079 -1.72008 -1.389134
N  -2.421144 2.145691 0.622507
N  -2.651371 1.165422 -0.314375
N  3.708103 -0.279821 0.457682
C  -3.738001 -2.146717 -0.594708
C  -3.871943 -0.730641 -1.24781
C  -2.341774 -2.443622 -0.061593
C  0.406173 2.290891 0.083472
C  1.190984 2.353756 1.246198
C  0.677443 1.425903 -0.98756
C  2.589707 0.579702 0.280487
C  -3.712701 0.398565 -0.261389
C  2.299408 1.493019 1.333386
C  1.780475 0.555353 -0.888555
C  -1.240485 -2.573282 -0.948622
C  -2.107045 -2.585853 1.328748
C  0.059802 -2.830795 -0.462108
C  -0.808683 -2.851038 1.82334
C  0.278356 -2.97251 0.928948
C  4.120745 -1.354103 -0.340543
C  5.379094 -2.064465 0.151733
H  -4.016126 -2.892476 -1.365678
H  -4.480854 -2.24233 0.22072
H  -4.872274 -0.661322 -1.721306
H  -3.114666 -0.611028 -2.042059
H  0.940019 3.055488 2.047612
H  0.038619 1.425842 -1.874864
H  -4.492233 0.518011 0.5181
H  2.931541 1.517884 2.229622
H  2.010902 -0.151191 -1.686409
H  -1.401615 -2.469319 -2.029505
H  -2.946048 -2.488754 2.029433
H  -3.21605 2.699583 1.009585
H  0.903386 -2.912967 -1.156942
H  -0.648196 -2.959547 2.90236
H  4.265507 -0.105274 1.296792
H  1.286598 -3.176388 1.308098
H  6.162554 -1.979692 -0.62121
H  5.159231 -3.138658 0.274112
H  5.777468 -1.670894 1.103058
