program: Gaussian 09
title: 000229229
version: EM64L-G09RevD.01
frameworkgroup: C1[X(C16H19N3O5S)]
method: RPBEPBE
basis: SDD
operation: Freq
keyword: #p
keyword: freq=noraman
keyword: PBEPBE/SDD
title: #p freq=noraman PBEPBE/SDD
converged: YES YES NO NO
title: Mulliken charges:
elementType: S O O O O O N N N C C C C C C C C C C C C C C C C H H H H H H H H H H H H H H H H H H H
charge: 0.957486 -0.296604 -0.285192 -0.293827 -0.520634 -0.547175 -0.484577 0.009325 -0.686375 -0.082519 0.542300 0.051624 0.306016 0.256187 -0.534775 -0.580264 -0.204818 -0.210944 0.513721 -0.378225 -0.384542 -0.385793 -0.516608 -0.535965 -0.524728 0.285633 0.252889 0.275546 0.277372 0.298767 0.223187 0.229081 0.230786 0.314764 0.315363 0.227225 0.259290 0.221315 0.227573 0.233184 0.240515 0.226794 0.265699 0.211924
chargesum: 0.00000
title: Mulliken charges with hydrogens summed into heavy atoms:
elementType: S O O O O O N N N C C C C C C C C C C C C C C C C
charge: 0.957486 -0.296604 -0.285192 -0.293827 -0.520634 -0.547175 -0.185809 0.009325 -0.056249 -0.082519 0.542300 0.051624 0.306016 0.256187 -0.249143 -0.327375 0.070729 0.066428 0.513721 -0.155037 -0.155461 -0.155007 0.191221 0.165307 0.179689
polarizability: 4.47015647e+02 2.44429060e+00 2.62153236e+02 -8.49503922e+00 -9.67017486e+00 1.80285765e+02
1716.lowfreq: -1.4387 -0.6048 0.0011 0.0012 0.0013 5.6480 9.0804 13.8741 25.8900
frequency: 8.5344 13.7058 25.8689 38.4338 45.0130 67.8716 78.6238 79.9799 99.2118 105.5021 116.3632 129.3347 146.6123 149.9222 163.3576 174.8579 190.7360 201.7216 205.6165 222.1462 230.1485 253.8396 273.8605 282.0552 297.7011 300.0139 314.9228 336.3827 351.1815 382.8608 393.4647 402.2725 409.6157 414.0040 422.5389 433.5270 446.2880 472.4715 501.7781 519.7872 523.0283 598.4407 602.9767 622.8295 627.3249 640.1709 657.7440 720.9735 740.9029 765.1829 774.7853 800.0538 813.9013 816.3752 834.8042 858.5266 871.0707 875.7784 925.6817 940.1480 946.7490 950.8741 956.2082 967.3022 982.4074 1005.2991 1021.6956 1041.8027 1053.8466 1067.1444 1109.2071 1111.6073 1113.5924 1130.6425 1136.9525 1153.0827 1159.6573 1163.0262 1182.9425 1201.4366 1220.2984 1269.8698 1299.3213 1309.3012 1322.5823 1362.4796 1392.2854 1400.3318 1407.3144 1419.1681 1436.2896 1436.5320 1444.2597 1455.0996 1457.5140 1466.4029 1469.9082 1481.3032 1481.4211 1486.0904 1490.7171 1553.3978 1581.3867 1586.3715 1599.6228 1615.2011 1648.4166 2967.3247 2972.5868 2982.3449 3003.5958 3058.4874 3080.7676 3089.3715 3125.7851 3126.1106 3127.2315 3133.9900 3136.0848 3151.2717 3163.9434 3167.0172 3173.3327 3199.2989 3562.3682 3701.1868
redmass: 5.9868 5.2002 4.7066 4.8885 4.5918 3.2676 2.4912 3.3510 3.8499 3.5485 3.7446 4.2817 1.7767 4.0297 1.4603 3.9996 3.7778 2.5793 3.9136 3.1649 8.5370 2.7427 4.0640 3.1826 3.6963 4.6544 5.3850 4.9314 5.5127 4.8366 9.8182 3.2380 1.0141 2.9554 3.4578 1.6848 5.7134 4.5025 4.4932 6.6407 2.8111 4.5628 6.2763 6.8928 4.5505 3.8394 4.5859 2.8903 2.8508 3.1344 3.1336 6.8710 5.3552 1.3034 1.8625 2.0626 3.1198 1.5353 1.7525 7.4254 9.8414 7.5092 1.3749 1.3776 4.8575 4.5695 1.4435 3.1172 2.5846 6.4203 1.2356 1.2395 1.2588 1.1908 2.4034 1.3810 1.4566 1.6114 1.1172 1.9552 1.5319 1.1808 1.2948 2.9488 2.6302 3.6620 2.2597 5.4666 2.4190 1.3015 3.6879 1.3652 1.3863 1.1281 1.0864 1.0701 1.5884 1.0594 1.4770 1.0654 2.9600 7.0439 6.7734 7.3825 6.4078 4.7422 1.2306 1.0321 1.0344 1.0317 1.0879 1.1043 1.0977 1.1013 1.1006 1.1046 1.1044 1.0893 1.0892 1.0919 1.0954 1.0964 1.0910 1.0739 1.0453 1.1040
irintensity: 1.8720 0.8569 0.5802 1.0983 0.9496 2.9464 6.4811 8.7798 2.6502 4.3633 2.9491 0.8769 2.1087 5.1170 3.8067 5.0295 6.9911 9.6721 5.5664 25.6904 12.1168 2.1520 4.9179 17.1251 15.0969 9.6134 5.9569 0.0972 12.3512 41.2508 55.0160 4.5061 0.3416 0.3145 58.6296 268.6932 148.4803 49.6140 44.1731 8.5989 26.5284 1.3370 15.7002 0.5479 20.1351 9.2690 8.2217 3.2812 137.3688 143.9231 190.1103 52.0976 80.7866 6.4318 79.3680 13.0122 11.1437 16.2083 42.8127 42.2687 9.8949 64.7844 1.5535 0.7595 4.0537 27.3339 1.6670 16.4671 66.9420 259.4330 23.4930 2.9245 0.4247 13.5265 28.1832 17.1823 17.5329 14.3122 58.1292 56.8365 42.8518 7.1191 3.6307 264.7501 70.1640 79.5556 48.1087 3.7768 65.7677 5.9099 2.7340 22.2746 25.5420 21.1533 3.1626 17.1653 100.4028 23.0021 53.1579 41.8761 71.0396 89.9895 44.1913 8.2952 3.7117 181.5200 287.0341 44.7841 100.8372 97.5182 43.4086 36.6365 36.7246 29.8114 23.3740 16.4922 25.2044 12.3697 16.3229 3.8555 1.9883 11.8255 2.5404 10.4993 124.7780 25.2193
temp: 298.150 k
press: 1.00000 atm
elementType: 16 8 8 8 8 8 7 7 7 6 6 6 6 6 6 6 6 6 6 6 6 6 6 6 6 1 1 1 1 1 1 1 1 1 1 1 1 1 1 1 1 1 1 1
symmnumber: 1
zpe: 868388.9 jmol-1
zpe.correction: 0.330752 hartree
zpe.thermalcorrener: 0.357668 hartree
zpe.thermalcorrenthalpy: 0.358612 hartree
zpe.thermalcorrgfe: 0.270316 hartree
zpe.sumelectzpe: -1557.423790 hartree
zpe.sumelectthermal: -1557.396874 hartree
zpe.sumelectthermalent: -1557.395930 hartree
zpe.sumelectthermalfe: -1557.484227 hartree
dipole: -2.2839 6.0735 4.3938
dipole: 7.8364
quadrupole: -124.7996 -137.3089 -154.3233
quadrupole: -23.4394 -29.4181 -7.7921
quadrupole: 14.0110 1.5017 -15.5127 -23.4394 -29.4181 -7.7921
hfenergy: -1557.7545421 hartree
pointgroup: C01 [X(C16H19N3O5S1)]
dipole: -0.5154337 2.1923009 -2.1055667 debye
polarizability: 443.2112117|-13.9818482|180.3872234|24.2757907|-9.1843117|265.8562128 unknown
InChI: InChI=1S/C16H19N3O5S/c1-22-14-8-11(9-15(23-2)16(14)24-3)10-18-19-25(20,21)13-6-4-12(17)5-7-13/h4-10,19H,17H2,1-3H3
charge 0 multiplicity 1
44 atoms
S  -3.256279 -1.281733 0.87812
O  5.604637 0.117513 -0.079312
O  3.449016 -0.532815 -1.737098
O  5.12925 0.745995 2.663515
O  -2.452905 -2.428025 0.047984
O  -4.361203 -1.627369 2.028583
N  -1.999545 -0.166732 1.914567
N  -0.748773 -0.170077 1.377535
N  -5.620092 2.620266 -3.087008
C  -3.974598 -0.077718 -0.334833
C  1.660598 0.094543 1.514612
C  4.291919 0.090304 0.42039
C  3.15765 -0.230405 -0.396165
C  4.07508 0.454857 1.77875
C  1.860158 -0.235562 0.145723
C  2.770136 0.45026 2.318791
C  -3.425708 -0.017558 -1.628846
C  -5.054468 0.726981 0.073709
C  -5.074286 1.725599 -2.175631
C  0.323036 0.065846 2.112463
C  -3.980091 0.886157 -2.550493
C  -5.605983 1.627314 -0.852013
C  6.123293 -1.147617 -0.64983
C  2.314963 -0.840932 -2.614939
C  6.046936 1.839616 2.274003
H  0.981845 -0.492166 -0.451773
H  2.648399 0.71779 3.37359
H  -2.598538 -0.678948 -1.904751
H  -5.462149 0.631545 1.085064
H  -2.133546 -0.509487 2.895904
H  0.251733 0.270195 3.197993
H  -3.57124 0.947397 -3.565571
H  -6.45197 2.258868 -0.557724
H  -5.251246 2.695837 -4.030755
H  -6.401168 3.217099 -2.829785
H  7.163158 -0.925742 -0.934187
H  5.5338 -1.443578 -1.532722
H  6.101722 -1.945754 0.115702
H  1.613114 0.012978 -2.669127
H  1.774613 -1.743964 -2.272514
H  2.760734 -1.022636 -3.60397
H  6.794509 1.884729 3.080663
H  6.527426 1.622349 1.306291
H  5.493859 2.797583 2.22009
