program: Gaussian 09
title: 000229210
version: EM64L-G09RevD.01
frameworkgroup: C1[X(C15H13Cl2N3O3S)]
method: RPBEPBE
basis: SDD
operation: Freq
keyword: #p
keyword: freq=noraman
keyword: PBEPBE/SDD
title: #p freq=noraman PBEPBE/SDD
converged: YES YES NO NO
title: Mulliken charges:
elementType: Cl Cl S O O O N N N C C C C C C C C C C C C C C C H H H H H H H H H H H H H
charge: -0.009812 -0.002063 0.965027 -0.533302 -0.501304 -0.242086 -0.500911 -0.455378 0.031245 -0.058204 -0.232585 -0.213690 0.502257 -0.317083 -0.420940 0.491836 -0.357681 0.232720 -0.332175 -0.400339 -0.067945 -0.195033 -0.098576 -0.777519 0.285637 0.283211 0.323362 0.233551 0.303781 0.309026 0.220537 0.293624 0.235806 0.260332 0.215111 0.265057 0.264505
chargesum: 0.00000
title: Mulliken charges with hydrogens summed into heavy atoms:
elementType: Cl Cl S O O O N N N C C C C C C C C C C C C C C C
charge: -0.009812 -0.002063 0.965027 -0.533302 -0.501304 -0.242086 -0.197129 -0.146351 0.031245 -0.058204 0.053052 0.069521 0.502257 0.006279 -0.187389 0.491836 -0.137144 0.232720 -0.038551 -0.164533 -0.067945 0.065299 -0.098576 -0.032847
polarizability: 3.76115329e+02 1.76843829e+01 3.11172654e+02 2.48667978e-01 2.82152128e+01 1.62943579e+02
1716.lowfreq: -3.6330 -0.0020 -0.0015 0.0013 2.9784 4.1788 6.7476 14.6653 24.1748
frequency: 6.4521 14.6494 24.1578 37.6546 41.5771 55.7963 70.6500 75.9795 90.9394 101.3857 132.6202 147.8507 157.4989 169.1571 185.3597 189.1572 203.5004 213.9745 230.6443 265.4600 297.3993 308.2605 329.3343 345.2776 362.8702 378.7879 392.3186 413.1465 416.6930 423.0454 443.8973 445.9172 497.6365 513.5602 529.5906 549.2616 579.3656 597.0791 618.3267 651.6467 659.0830 672.8215 687.0818 704.1457 728.9919 746.5697 810.3476 816.8538 825.3982 830.8127 873.7362 898.9224 907.0276 923.3092 929.8065 954.5160 955.9019 959.6713 985.7190 995.1929 1001.4322 1004.2406 1040.8055 1041.9401 1056.0190 1114.6786 1123.5404 1146.5442 1184.7156 1214.3301 1223.1441 1251.9537 1265.5544 1278.6002 1297.3467 1357.4069 1371.6296 1391.6529 1393.2224 1395.3836 1409.2334 1449.1267 1459.4149 1470.0855 1476.8905 1502.2421 1545.9212 1573.7110 1593.6929 1594.6849 1600.8321 1633.7051 2998.5125 3005.4647 3100.1246 3101.8608 3128.0729 3138.5074 3163.7962 3168.2591 3173.1866 3176.4611 3198.4250 3233.2105 3533.3079
redmass: 8.7750 9.0416 6.1333 11.2373 4.3685 1.7101 2.3627 4.3224 8.4626 7.1314 5.9043 5.7047 9.7670 7.7000 12.2363 6.5244 5.2500 7.2460 6.9564 5.2655 10.3606 6.1524 7.4515 6.0488 5.0561 4.9470 7.1505 4.4097 4.2646 8.7745 3.3624 6.2229 2.8901 5.9500 3.0224 4.2536 4.8469 3.0972 6.9903 1.1973 7.1337 4.9628 3.8921 3.3700 3.2515 2.6116 10.6820 1.3402 5.4374 1.4256 1.4244 1.6283 3.1442 1.5843 6.2095 1.4043 9.6958 1.4576 4.3351 1.7046 4.8656 1.3408 1.6444 4.9010 2.5464 2.1528 1.3100 1.4501 1.1270 3.3666 1.8232 1.2972 1.9017 1.2917 1.4095 4.0947 4.0243 1.2264 2.1971 3.3803 4.7591 1.0446 3.0904 1.1679 2.0505 2.2438 8.1759 6.2525 6.6612 6.7713 5.7223 4.9508 1.0364 1.0878 1.0990 1.0998 1.0901 1.0898 1.0915 1.0955 1.0948 1.0931 1.0954 1.0744 1.0767
irintensity: 1.2694 0.5818 4.1672 1.6202 2.2692 0.3440 0.4796 5.5405 0.1418 3.0308 4.6431 2.8960 1.9031 1.4983 1.6462 4.9010 23.8502 5.6084 9.6444 5.4510 25.2250 31.0669 1.7595 53.7701 4.3608 13.4782 18.0700 4.4428 4.0297 7.6850 8.3949 84.2153 99.4051 18.0642 82.8838 58.1545 8.4862 1.6667 2.8129 55.7126 13.3444 14.6331 116.5286 2.8913 2.6202 282.5343 97.1179 27.1527 27.3325 32.7132 48.1889 8.7244 54.7257 47.4689 4.4130 2.6554 57.7821 4.2790 6.6187 14.3962 31.0449 0.9292 16.6279 18.9895 48.0899 42.5043 8.8229 5.9738 40.3518 77.2238 27.8895 7.9672 66.0203 14.5652 54.1857 43.0396 245.7134 43.6471 21.9942 15.6820 15.8310 15.8747 56.9654 14.4563 38.6324 430.3386 15.5582 2.0494 4.0840 102.6174 33.5188 101.5881 9.9547 44.7805 9.8299 12.1876 15.1420 7.9416 2.9304 6.0570 3.4830 2.9605 10.4413 1.1937 17.3842
temp: 298.150 k
press: 1.00000 atm
elementType: 17 17 16 8 8 8 7 7 7 6 6 6 6 6 6 6 6 6 6 6 6 6 6 6 1 1 1 1 1 1 1 1 1 1 1 1 1
symmnumber: 1
zpe: 669649.5 jmol-1
zpe.correction: 0.255056 hartree
zpe.thermalcorrener: 0.279324 hartree
zpe.thermalcorrenthalpy: 0.280269 hartree
zpe.thermalcorrgfe: 0.195756 hartree
zpe.sumelectzpe: -2285.585065 hartree
zpe.sumelectthermal: -2285.560797 hartree
zpe.sumelectthermalent: -2285.559853 hartree
zpe.sumelectthermalfe: -2285.644365 hartree
dipole: -3.6291 0.5534 -6.9832
dipole: 7.8893
quadrupole: -123.9434 -172.6014 -162.5037
quadrupole: -33.4180 12.1261 5.7482
quadrupole: 29.0727 -19.5852 -9.4876 -33.4180 12.1261 5.7482
hfenergy: -2285.8401211 hartree
pointgroup: C01 [X(C15H13Cl2N3O3S1)]
dipole: -1.3303398 -0.4031403 2.7752342 debye
polarizability: 374.4476193|-18.3231394|306.5550228|-8.7694915|41.2847099|169.2289206 unknown
InChI: InChI=1S/C15H13Cl2N3O3S/c1-10(21)19-12-3-5-13(6-4-12)24(22,23)20-18-9-11-2-7-14(16)15(17)8-11/h2-9,19-20H,1H3
charge 0 multiplicity 1
37 atoms
Cl 3.575289 -2.628257 -1.622416
Cl 6.628769 -2.399585 -0.423425
S  -1.129322 2.946856 -0.461847
O  -1.872078 4.269684 0.126462
O  -0.570655 2.861955 -1.984058
O  -3.867107 -3.504399 -0.93082
N  0.314356 2.751637 0.823393
N  -4.524938 -1.944104 0.697012
N  1.238783 1.826447 0.460637
C  -2.146813 1.422843 -0.110411
C  -1.974835 0.297796 -0.931538
C  -3.066719 1.474732 0.950594
C  -3.699688 -0.833146 0.386263
C  -2.759892 -0.846065 -0.683303
C  -3.848049 0.33227 1.193322
C  3.449502 0.832378 0.585008
C  2.476274 1.877103 0.917946
C  -4.587031 -3.193932 0.059747
C  3.103679 -0.267496 -0.249032
C  4.772584 0.91836 1.098647
C  4.060519 -1.245869 -0.5569
C  5.729617 -0.06628 0.785464
C  5.376423 -1.151699 -0.043002
C  -5.604119 -4.160914 0.657695
H  -1.256489 0.320332 -1.756824
H  -3.177663 2.38292 1.550613
H  -2.659966 -1.742344 -1.297075
H  -4.578506 0.344145 2.011433
H  0.602003 3.721289 1.087129
H  -5.159107 -1.812625 1.488202
H  2.819066 2.691053 1.585091
H  2.087185 -0.338746 -0.645204
H  5.056661 1.757473 1.743706
H  6.748637 -0.001975 1.177235
H  -6.147153 -3.762099 1.531834
H  -5.084003 -5.08769 0.954305
H  -6.336715 -4.43495 -0.120883
