program: Gaussian 09
title: 000229206
version: EM64L-G09RevD.01
frameworkgroup: C1[X(C14H15N3O3S2)]
method: RPBEPBE
basis: SDD
operation: Freq
keyword: #p
keyword: freq=noraman
keyword: PBEPBE/SDD
title: #p freq=noraman PBEPBE/SDD
converged: YES YES NO NO
title: Mulliken charges:
elementType: S S O O O N N N C C C C C C C C C C C C C C H H H H H H H H H H H H H H H
charge: 0.952303 0.299306 -0.539642 -0.506889 -0.244857 -0.475624 -0.454431 -0.022182 -0.071837 -0.212130 -0.217200 0.501091 -0.321629 -0.423152 0.236214 -0.196412 -0.770904 -0.286343 0.229674 -0.138377 -0.515330 -0.778403 0.284299 0.284237 0.320119 0.231187 0.295346 0.307517 0.234645 0.247302 0.258425 0.240294 0.246156 0.266286 0.214668 0.262669 0.263601
chargesum: 0.00000
title: Mulliken charges with hydrogens summed into heavy atoms:
elementType: S S O O O N N N C C C C C C C C C C C C C C
charge: 0.952303 0.299306 -0.539642 -0.506889 -0.244857 -0.180278 -0.146914 -0.022182 -0.071837 0.072169 0.067037 0.501091 -0.001509 -0.191965 0.236214 -0.196412 -0.030531 -0.046049 0.229674 0.107778 -0.249043 -0.037465
polarizability: 3.36459238e+02 2.23801759e+01 2.98569269e+02 3.41077471e+00 -2.38818055e+01 1.56016757e+02
1716.lowfreq: -3.1569 -1.7995 -0.0023 -0.0014 -0.0013 6.5326 10.4737 18.3817 22.5806
frequency: 9.9166 18.3426 22.3919 39.8771 48.2402 50.6106 59.1246 74.4480 92.4649 94.4801 103.6825 141.0474 148.0292 154.0991 171.8347 199.5192 214.2613 247.2125 293.9692 310.0931 325.5176 343.6383 351.0622 381.3792 399.1801 413.3157 416.5843 438.1055 454.5380 487.7372 529.0299 540.8042 549.7823 588.0147 597.1587 616.7456 619.2158 641.8656 649.6647 675.2828 693.8374 703.8038 729.9353 777.8797 809.5137 819.8732 821.8711 827.3620 833.1096 868.7060 907.6022 912.0586 930.0413 950.5719 962.2027 986.9728 995.3546 1000.3604 1007.8456 1026.8734 1040.7443 1056.9115 1063.3380 1087.4186 1094.9747 1123.3490 1184.6558 1214.4278 1220.2426 1264.9330 1281.6671 1298.3070 1316.4830 1354.3423 1372.3701 1390.8734 1394.8629 1408.2109 1448.7188 1457.1109 1469.2746 1470.3810 1476.2312 1477.2053 1502.7360 1517.5493 1550.4997 1595.1889 1601.7494 1632.3979 2965.7414 2997.6585 3041.4631 3099.1965 3101.5108 3126.2072 3126.5712 3165.8681 3167.1980 3170.7238 3188.4625 3195.9214 3200.2064 3234.8035 3533.3960
redmass: 7.6560 5.0729 4.2721 1.3627 3.8137 5.1828 2.1425 4.5794 1.7548 5.8517 3.5550 5.9936 6.4912 5.6105 7.4228 6.1731 7.0494 6.0069 4.2342 7.7528 4.3113 5.7968 4.7061 5.1242 5.5833 3.0463 5.9664 5.1133 5.6862 6.4242 2.9081 3.4780 4.3432 3.4013 3.1063 4.5446 6.8584 3.7399 1.1995 6.0078 5.6849 1.1765 3.2815 2.2322 9.6058 1.3669 3.9823 4.5237 1.4207 1.4414 1.3709 3.4190 6.3412 14.8540 1.3766 4.0557 1.7180 1.3695 2.2592 1.5274 1.6404 2.3984 1.8441 2.5519 1.1687 1.3150 1.1252 3.4307 1.5314 1.8853 1.3268 1.4097 2.3918 3.2797 4.0990 1.2276 1.2035 4.6975 1.0449 1.4494 1.1302 1.4268 1.7176 2.1797 2.2523 7.8397 5.2561 6.8196 5.7565 4.9027 1.0433 1.0364 1.0941 1.0998 1.0988 1.0950 1.0901 1.0926 1.0944 1.0893 1.0970 1.0735 1.0952 1.1002 1.0766
irintensity: 0.6772 0.8199 5.2597 1.2798 0.1677 0.9055 0.4694 6.1023 1.8021 0.2501 5.1489 9.4133 7.4206 1.7784 2.0351 13.5300 4.1085 5.2497 25.1339 2.3020 19.1418 55.2738 1.2819 2.1807 44.6435 1.5682 23.1255 28.0584 29.7496 15.4572 60.9614 1.5596 69.6410 11.1510 1.6259 13.4145 2.7129 75.4094 55.2818 1.9421 15.6086 101.1301 0.0661 215.2366 82.4872 16.7373 12.2932 43.1856 32.4337 49.1212 0.1391 20.4530 6.2749 61.4994 1.1276 7.0680 12.7810 2.6523 7.2827 7.0371 15.0746 49.7077 17.2803 3.8448 0.3326 9.4021 36.9720 68.1685 10.6304 67.0894 8.2026 52.6356 12.2131 17.1721 239.1316 43.5435 29.6082 15.2185 15.8204 34.2917 16.6203 15.5362 25.5965 44.3447 431.4663 21.5199 10.4037 102.9271 31.6745 100.9028 14.7309 11.1783 16.0900 13.9310 9.0318 14.5151 14.7252 0.0713 9.5185 8.6764 10.8404 19.9046 9.1436 0.6301 15.9833
temp: 298.150 k
press: 1.00000 atm
elementType: 16 16 8 8 8 7 7 7 6 6 6 6 6 6 6 6 6 6 6 6 6 6 1 1 1 1 1 1 1 1 1 1 1 1 1 1 1
symmnumber: 1
zpe: 704362.0 jmol-1
zpe.correction: 0.268277 hartree
zpe.thermalcorrener: 0.291493 hartree
zpe.thermalcorrenthalpy: 0.292438 hartree
zpe.thermalcorrgfe: 0.210679 hartree
zpe.sumelectzpe: -1726.734346 hartree
zpe.sumelectthermal: -1726.711130 hartree
zpe.sumelectthermalent: -1726.710185 hartree
zpe.sumelectthermalfe: -1726.791944 hartree
dipole: 1.6619 -2.5373 -6.0231
dipole: 6.7437
quadrupole: -88.9463 -157.1484 -147.4968
quadrupole: 4.1964 -6.8872 -8.1944
quadrupole: 42.2509 -25.9513 -16.2997 4.1964 -6.8872 -8.1944
hfenergy: -1727.0026228 hartree
pointgroup: C01 [X(C14H15N3O3S2)]
dipole: 0.6793611 -1.2333677 -2.2486791 debye
polarizability: 336.7309412|22.8487119|292.1087805|3.5905421|-37.1452065|162.2055423 unknown
InChI: InChI=1S/C14H15N3O3S2/c1-10(14-4-3-9-21-14)16-17-22(19,20)13-7-5-12(6-8-13)15-11(2)18/h3-9,15,17H,1-2H3
charge 0 multiplicity 1
37 atoms
S  -0.384177 2.666224 0.331397
S  -2.584921 -2.010206 0.749261
O  -0.115413 4.129052 -0.332474
O  -0.89855 2.492972 1.864821
O  4.310072 -2.526701 1.025525
N  -1.657731 1.866653 -0.948611
N  4.520562 -0.796336 -0.549551
N  -2.130272 0.672813 -0.483165
C  1.105162 1.572523 0.069015
C  1.26354 0.440685 0.883855
C  2.023261 1.942596 -0.927988
C  3.351858 -0.028685 -0.303063
C  2.400336 -0.372017 0.698344
C  3.15684 1.131363 -1.106995
C  -3.325208 0.213096 -0.851356
C  -3.704358 -1.101773 -0.356975
C  -4.242928 0.990199 -1.778155
C  -4.867119 -1.842438 -0.591837
C  4.949599 -1.969276 0.088709
C  -4.900467 -3.110862 0.084985
C  -3.763109 -3.356364 0.840917
C  6.265129 -2.534012 -0.440659
H  0.521879 0.203237 1.652433
H  1.860968 2.844304 -1.526301
H  2.562627 -1.261975 1.307839
H  3.894484 1.399173 -1.873453
H  -2.336134 2.638355 -1.155054
H  5.127058 -0.443955 -1.293403
H  -4.439953 2.006238 -1.378068
H  -5.21541 0.495808 -1.909383
H  -3.777433 1.111852 -2.774786
H  -5.68083 -1.49417 -1.232145
H  -5.734937 -3.812138 0.011891
H  -3.523284 -4.227513 1.448544
H  6.724734 -1.93198 -1.243579
H  6.088689 -3.555515 -0.819436
H  6.980034 -2.616525 0.395701
