program: Gaussian 09
title: 000229195
version: EM64L-G09RevD.01
frameworkgroup: C1[X(C13H19N3O4S)]
method: RPBEPBE
basis: SDD
operation: Freq
keyword: #p
keyword: freq=noraman
keyword: PBEPBE/SDD
title: #p freq=noraman PBEPBE/SDD
converged: YES YES NO NO
title: Mulliken charges:
elementType: S O O O O N N N C C C C C C C C C C C C C H H H H H H H H H H H H H H H H H H H
charge: 0.964807 -0.504901 -0.528088 -0.195947 -0.196075 0.007568 -0.497990 0.027179 -0.490571 -0.354352 0.190039 -0.341809 -0.533739 -0.691635 -0.666231 -0.055251 -0.203348 -0.189379 -0.330706 -0.336227 0.394648 0.234801 0.197728 0.213500 0.204122 0.206588 0.187879 0.232832 0.245644 0.213446 0.217983 0.209429 0.230016 0.212831 0.233812 0.306278 0.292897 0.297443 0.297502 0.297275
chargesum: 0.00000
title: Mulliken charges with hydrogens summed into heavy atoms:
elementType: S O O O O N N N C C C C C C C C C C C C C
charge: 0.964807 -0.504901 -0.528088 -0.195947 -0.196075 0.007568 -0.191712 0.027179 -0.058042 0.063271 0.190039 0.052658 -0.055263 -0.050777 0.010428 -0.055251 0.089549 0.108064 -0.033204 -0.038951 0.394648
polarizability: 2.58558003e+02 -1.79049544e+01 2.16090343e+02 9.63706079e+00 1.49582702e+01 1.78637288e+02
1716.lowfreq: -19.2702 -2.2941 0.0020 0.0021 0.0024 4.9800 9.4574 11.5372 27.7584
frequency: -14.6475 11.4292 27.6852 30.0450 51.4236 62.7438 68.5609 75.1473 92.6793 95.9244 114.4332 126.0109 148.3236 179.7532 198.1479 203.1283 206.5136 226.2585 233.0889 249.5956 253.3162 268.7080 325.1082 343.1692 368.3134 377.2701 399.8513 411.4036 415.1426 472.9451 475.4680 504.8861 505.9189 564.0301 612.4723 662.3638 668.7416 680.4466 701.2703 737.2994 749.8791 775.0038 783.3195 805.2285 812.0016 841.5635 853.7191 870.5229 871.1885 916.3046 950.7283 964.3756 970.4848 992.6133 995.0019 1000.6206 1009.1699 1041.0638 1049.6598 1058.1205 1069.1949 1086.2001 1105.3434 1105.8449 1122.8913 1171.2596 1198.3851 1217.3370 1225.7040 1245.6627 1270.6238 1282.7880 1284.3215 1289.6267 1299.6515 1313.6003 1328.2016 1356.9751 1370.0633 1392.7651 1392.7898 1395.4802 1424.1615 1452.6894 1456.6355 1462.3240 1473.6470 1474.0970 1478.0724 1478.5249 1486.9039 1491.0833 1582.4441 1589.1933 1607.8464 2962.2994 2974.6331 2976.0161 2983.8658 2986.8340 2987.5974 3009.2274 3040.9655 3054.2909 3061.0401 3072.0327 3075.8152 3081.6516 3089.9288 3164.5351 3170.1397 3188.9024 3191.5654 3239.1081
redmass: 3.7965 5.1451 5.7214 5.0392 3.3817 4.7138 4.7946 4.5718 2.4556 2.7552 9.2118 3.4723 3.3596 3.3996 2.4487 3.2590 4.2844 2.2325 1.6128 2.6245 2.9513 6.2424 3.1845 6.3815 10.7733 3.0643 3.9269 2.9486 5.0403 4.4771 3.7962 4.3679 7.0477 3.1483 7.0954 4.8930 2.9710 7.6931 3.1581 4.2190 1.2305 1.4435 7.1659 1.7776 9.5996 1.7798 1.2393 1.5169 1.5729 1.6003 11.5751 1.9154 2.2140 1.4280 4.4584 1.3850 2.9225 1.9802 2.2961 1.8038 1.7416 4.2277 1.3019 1.9052 2.0425 1.2272 1.6327 8.7426 1.4543 1.2666 1.3251 1.2452 1.1903 1.2596 1.1785 1.3352 1.7914 1.5628 6.6326 5.3888 1.2244 1.2008 6.8588 2.1673 1.0992 1.0880 1.0433 1.0598 1.0437 1.0412 1.0774 1.0952 6.2322 8.0377 8.4482 1.0597 1.0473 1.0489 1.0357 1.0637 1.0628 1.0977 1.1020 1.0981 1.1011 1.1008 1.0994 1.0999 1.1008 1.0907 1.0905 1.0955 1.0967 1.0739
irintensity: 0.4024 0.0966 0.1445 0.2332 0.1593 0.8638 0.1603 5.2530 0.8151 0.5440 4.3192 1.5079 6.9435 0.2111 5.1295 2.3142 2.0294 0.2596 0.7378 0.2214 0.9643 12.0219 15.7951 6.1645 46.0523 32.7948 26.3770 1.3770 18.7308 16.3709 12.3870 65.8691 2.7258 24.4121 0.1664 24.2581 1.8323 22.2219 31.2069 5.2778 21.4149 19.6122 33.1900 10.6417 103.9250 50.9225 0.3020 40.2509 8.6308 31.3982 70.1394 5.3684 4.3182 4.1499 2.6871 0.0284 5.0820 11.7671 29.1908 3.1448 1.4167 4.6087 7.2087 7.3702 2.6695 12.1843 6.8764 257.7431 2.7723 1.1689 2.0896 0.2198 1.5909 3.8708 2.6543 1.7090 18.9176 2.9721 56.6250 60.3950 15.2386 12.9215 41.7564 7.6995 12.9943 3.6140 11.7889 5.0626 10.7487 3.0122 7.7865 20.9365 23.8937 42.0896 0.3065 21.6903 12.9439 75.7409 25.6114 17.6439 23.9840 3.1554 40.3000 2.6365 16.2459 80.3643 42.7838 62.4775 27.1361 3.9715 4.4817 3.2136 1.0682 15.9690
temp: 298.150 k
press: 1.00000 atm
elementType: 16 8 8 8 8 7 7 7 6 6 6 6 6 6 6 6 6 6 6 6 6 1 1 1 1 1 1 1 1 1 1 1 1 1 1 1 1 1 1 1
symmnumber: 1
zpe: 811979.5 jmol-1
zpe.correction: 0.309267 hartree
zpe.thermalcorrener: 0.331914 hartree
zpe.thermalcorrenthalpy: 0.332858 hartree
zpe.thermalcorrgfe: 0.254318 hartree
zpe.sumelectzpe: -1368.093080 hartree
zpe.sumelectthermal: -1368.070432 hartree
zpe.sumelectthermalent: -1368.069488 hartree
zpe.sumelectthermalfe: -1368.148029 hartree
dipole: 5.9325 2.2091 -1.0974
dipole: 6.4248
quadrupole: -133.9585 -155.5729 -133.0188
quadrupole: 12.2889 -2.9060 5.5044
quadrupole: 6.8916 -14.7228 7.8313 12.2889 -2.9060 5.5044
hfenergy: -1368.4023463 hartree
pointgroup: C01 [X(C13H19N3O4S1)]
dipole: -1.6611386 1.7552558 0.7410106 debye
polarizability: 263.0650436|-7.2136293|210.1074379|-12.2838075|-16.4015429|180.1131526 unknown
InChI: InChI=1S/C13H19N3O4S/c1-3-5-6-11(4-2)14-15-21(19,20)13-9-7-12(8-10-13)16(17)18/h7-10,15H,3-6H2,1-2H3
charge 0 multiplicity 1
40 atoms
S  -0.973468 -2.605726 -0.044849
O  -1.606889 -2.840598 -1.524131
O  -1.01471 -3.75001 1.11045
O  5.630405 -0.941221 0.16006
O  5.114743 -0.203111 -1.935841
N  -1.84237 -0.005548 -0.055048
N  -1.69403 -1.039207 0.861401
N  4.803814 -0.754217 -0.812047
C  -2.628842 2.143359 -0.816772
C  -1.463621 3.162837 -0.638895
C  -2.617862 1.027049 0.213535
C  -1.475739 3.944011 0.694937
C  -3.469553 1.143533 1.470704
C  -0.347147 4.994951 0.767876
C  -4.870996 0.491725 1.282954
C  0.801891 -2.017296 -0.27448
C  1.702582 -2.223044 0.783202
C  1.144408 -1.428314 -1.502097
C  3.036885 -1.805082 0.602879
C  2.479074 -1.009203 -1.680689
C  3.394755 -1.201771 -0.623254
H  -2.551404 1.697276 -1.824746
H  -3.596369 2.679657 -0.757102
H  -0.50543 2.615283 -0.736512
H  -1.507468 3.884469 -1.479696
H  -1.370319 3.237501 1.542322
H  -2.457998 4.445736 0.819104
H  -2.94827 0.675208 2.329298
H  -3.603314 2.210617 1.719598
H  0.645442 4.51661 0.67031
H  -0.365236 5.542024 1.728058
H  -0.442322 5.737688 -0.046526
H  -5.423969 0.978449 0.45997
H  -4.800312 -0.584906 1.041102
H  -5.469782 0.593928 2.205202
H  -2.551474 -1.400207 1.338767
H  1.371254 -2.708614 1.706199
H  0.393488 -1.317761 -2.289621
H  3.791844 -1.935837 1.381969
H  2.816609 -0.541538 -2.608793
