program: Gaussian 09
title: 000229192
version: EM64L-G09RevD.01
frameworkgroup: C1[X(C13H17N3O4S)]
method: RPBEPBE
basis: SDD
operation: Freq
keyword: #p
keyword: freq=noraman
keyword: PBEPBE/SDD
title: #p freq=noraman PBEPBE/SDD
converged: YES YES NO NO
title: Mulliken charges:
elementType: S O O O O N N N C C C C C C C C C C C C C H H H H H H H H H H H H H H H H H
charge: 0.964728 -0.505280 -0.530133 -0.196303 -0.196275 -0.001040 -0.497261 0.027172 -0.144959 -0.419968 -0.408704 -0.384453 -0.536998 0.149929 -0.732094 -0.056413 -0.202383 -0.191021 -0.330854 -0.334215 0.394622 0.240054 0.207206 0.211709 0.202349 0.217675 0.216629 0.212372 0.234608 0.222831 0.212480 0.224649 0.241104 0.303832 0.292628 0.297451 0.297330 0.296999
chargesum: 0.00000
title: Mulliken charges with hydrogens summed into heavy atoms:
elementType: S O O O O N N N C C C C C C C C C C C C C
charge: 0.964728 -0.505280 -0.530133 -0.196303 -0.196275 -0.001040 -0.193430 0.027172 0.095096 -0.001053 0.011319 0.044548 -0.079559 0.149929 -0.053862 -0.056413 0.090245 0.106429 -0.033524 -0.037216 0.394622
polarizability: 2.66815067e+02 -6.55213646e+00 2.02748014e+02 -1.06676595e+01 -1.41498539e+01 1.82564319e+02
1716.lowfreq: -22.4616 -6.5461 -4.4747 -0.0018 -0.0016 -0.0014 10.0089 16.0843 22.5039
frequency: -12.1806 15.4422 22.3924 45.9400 64.3189 69.8000 78.6011 107.3536 114.1315 143.2329 166.5936 179.7655 193.1713 198.6919 211.3645 227.7665 263.6584 283.8503 328.5374 343.6881 353.4982 366.4327 393.2993 411.3027 418.3685 421.2119 448.3405 472.8934 503.8002 505.6029 534.4811 577.2303 612.2057 629.5051 662.3888 680.3399 700.4156 737.1027 782.4551 799.6638 807.0230 810.5276 835.7560 853.8198 861.8651 870.5911 890.5332 920.5752 951.0338 969.1851 985.6248 992.6791 995.1011 998.6001 1000.7707 1027.3667 1048.9399 1060.2503 1086.0934 1100.2752 1104.6492 1113.2632 1139.6260 1162.6116 1170.7097 1217.7087 1234.3859 1253.0104 1274.6925 1282.1584 1285.5936 1301.8134 1311.9361 1322.5854 1340.6022 1347.9294 1355.3762 1370.0621 1382.0074 1392.2748 1423.9921 1451.6463 1451.8457 1461.4334 1467.6966 1476.1885 1476.8697 1483.2872 1581.9773 1598.7568 1607.4950 2972.2994 2975.6223 2980.3898 2984.0620 2985.2963 3022.6661 3033.7938 3039.0555 3041.2943 3054.4635 3078.1265 3085.8488 3164.1637 3169.2829 3188.8101 3191.1450 3228.7510
redmass: 3.5914 6.0936 5.6086 4.0019 6.5918 6.7890 5.6268 5.7529 9.1297 2.8453 4.0893 3.4876 1.3142 7.0836 3.6242 7.6218 5.1111 2.8985 3.6243 2.7760 3.4104 11.8936 4.6832 2.8825 3.9106 5.0515 2.5554 7.1615 4.2793 7.2842 3.1263 2.6289 7.0889 3.1135 4.9082 7.9135 2.8943 4.2198 9.1716 1.7908 2.2425 8.8716 2.2877 1.2395 2.2547 1.5676 1.4839 2.2110 13.1730 2.3131 1.9615 1.4239 4.0808 1.6179 1.3851 1.9298 2.2888 1.7584 4.2513 1.4272 1.2851 1.7648 1.9386 1.5357 1.2263 8.9458 1.4191 1.3578 1.2481 1.2455 1.4858 1.4170 1.3015 1.5382 1.5343 1.4990 1.4249 6.5853 1.2184 5.7257 6.8688 1.1436 1.9831 1.0755 1.0803 1.0701 1.0751 1.0646 6.2249 8.7365 8.4624 1.0610 1.0606 1.0512 1.0480 1.0619 1.0851 1.0985 1.0964 1.1025 1.1042 1.0991 1.1001 1.0908 1.0906 1.0954 1.0967 1.0741
irintensity: 0.1657 0.0736 0.0612 0.4616 0.1657 2.2618 3.7588 0.0665 5.1517 0.9374 8.5579 2.4297 0.3602 7.6742 1.8913 3.6369 7.1525 3.6020 22.3800 7.1590 2.0058 53.3820 46.9761 0.1144 6.7869 4.3757 2.9766 24.5477 70.0535 0.9304 6.8235 21.8930 0.1422 16.6377 23.8571 25.0822 15.2462 5.2866 43.4453 25.1561 21.5548 88.7525 59.9227 0.3437 4.8326 46.7191 10.0336 25.4587 60.6987 19.4530 2.3106 3.0965 3.4229 13.4244 0.1406 9.0557 30.2810 2.4619 4.5290 0.0534 9.3741 5.3443 2.5501 8.9071 11.6318 267.6463 0.9178 0.4025 7.9483 0.0946 2.5286 1.5103 11.5915 1.7720 0.9357 2.0544 2.9616 56.0208 13.4654 61.4533 42.4879 16.6833 11.3269 2.1338 13.1872 10.5043 7.1394 12.6632 23.8657 61.1408 0.5293 11.0890 31.3392 8.1460 53.6193 32.5473 13.9296 56.5368 33.6510 23.2151 69.1929 36.2521 31.3776 3.9690 4.5857 3.2721 0.8710 16.9007
temp: 298.150 k
press: 1.00000 atm
elementType: 16 8 8 8 8 7 7 7 6 6 6 6 6 6 6 6 6 6 6 6 6 1 1 1 1 1 1 1 1 1 1 1 1 1 1 1 1 1
symmnumber: 1
zpe: 760673.7 jmol-1
zpe.correction: 0.289725 hartree
zpe.thermalcorrener: 0.310131 hartree
zpe.thermalcorrenthalpy: 0.311075 hartree
zpe.thermalcorrgfe: 0.238484 hartree
zpe.sumelectzpe: -1366.923963 hartree
zpe.sumelectthermal: -1366.903557 hartree
zpe.sumelectthermalent: -1366.902613 hartree
zpe.sumelectthermalfe: -1366.975205 hartree
dipole: -6.1276 -2.1714 -1.4447
dipole: 6.6595
quadrupole: -133.0682 -154.0701 -130.4440
quadrupole: 13.8037 3.4856 -5.2034
quadrupole: 6.1259 -14.8760 8.7501 13.8037 3.4856 -5.2034
hfenergy: -1367.2136883 hartree
pointgroup: C01 [X(C13H17N3O4S1)]
dipole: -2.1895603 1.3408637 0.5221175 debye
polarizability: 267.7114304|-3.7021801|187.0133527|-7.2626445|-17.2708112|197.4026158 unknown
InChI: InChI=1S/C13H17N3O4S/c1-10-4-2-3-5-13(10)14-15-21(19,20)12-8-6-11(7-9-12)16(17)18/h6-10,15H,2-5H2,1H3
charge 0 multiplicity 1
38 atoms
S  0.131078 -2.374398 0.923899
O  -0.491794 -3.274299 -0.279267
O  0.616652 -3.020261 2.336315
O  5.631532 1.33011 -0.641216
O  4.710802 1.118733 -2.717487
N  -1.698927 -0.401381 0.380224
N  -1.040114 -0.914616 1.491367
N  4.719855 0.901252 -1.446332
C  -3.392624 0.885591 -0.778382
C  -3.603373 2.426068 -0.670006
C  -4.344417 2.83643 0.624346
C  -3.604759 2.311759 1.875878
C  -3.412773 0.766655 1.822638
C  -2.771304 0.352663 0.506537
C  -4.714792 0.133087 -1.102939
C  1.538185 -1.353286 0.194977
C  2.535872 -0.892534 1.069502
C  1.533355 -1.124419 -1.190294
C  3.598051 -0.144976 0.521639
C  2.595115 -0.373989 -1.736762
C  3.601266 0.103991 -0.868953
H  -2.676902 0.675044 -1.594487
H  -4.158269 2.778783 -1.560748
H  -2.613168 2.924366 -0.687738
H  -5.381121 2.445071 0.612421
H  -4.425827 3.938923 0.674337
H  -4.158633 2.577175 2.795976
H  -2.609671 2.794175 1.943793
H  -4.406741 0.282626 1.912867
H  -2.806177 0.441937 2.688328
H  -5.482547 0.275568 -0.321292
H  -5.133455 0.503788 -2.05652
H  -4.530623 -0.950673 -1.207737
H  -1.622223 -1.358564 2.239073
H  2.488122 -1.127412 2.13722
H  0.733504 -1.533176 -1.814439
H  4.40991 0.242498 1.141925
H  2.654834 -0.154506 -2.805561
