program: Gaussian 09
title: 000229190
version: EM64L-G09RevD.01
frameworkgroup: C1[X(C13H12N4O4S)]
method: RPBEPBE
basis: SDD
operation: Freq
keyword: #p
keyword: freq=noraman
keyword: PBEPBE/SDD
title: #p freq=noraman PBEPBE/SDD
converged: YES YES NO NO
title: Mulliken charges:
elementType: S O O O O N N N N C C C C C C C C C C C C C H H H H H H H H H H H H
charge: 0.980312 -0.506085 -0.534289 -0.210576 -0.232719 -0.523321 0.047142 -0.683438 0.023512 -0.072720 -0.208824 -0.213442 0.515370 -0.383952 -0.382353 0.313943 0.216781 -0.323213 -0.355979 -0.346473 -0.230352 -0.212742 0.279298 0.278896 0.233228 0.234213 0.320999 0.282849 0.293720 0.286257 0.236724 0.241039 0.318299 0.317895
chargesum: 0.00000
title: Mulliken charges with hydrogens summed into heavy atoms:
elementType: S O O O O N N N N C C C C C C C C C C C C C
charge: 0.980312 -0.506085 -0.534289 -0.210576 -0.232719 -0.202323 0.047142 -0.047244 0.023512 -0.072720 0.070474 0.065454 0.515370 -0.150723 -0.148140 0.313943 0.216781 -0.040364 -0.062259 -0.060216 0.006372 0.028297
polarizability: 3.74842464e+02 -1.41760636e+01 2.40372397e+02 -7.56683499e+00 2.65638623e+01 1.61063656e+02
1716.lowfreq: -4.7964 -3.0065 0.0019 0.0020 0.0024 8.7580 10.0583 13.2433 24.5484
frequency: 9.8806 12.6483 24.5337 31.6050 50.8616 67.3287 101.4663 108.9134 131.4605 146.4928 167.8002 196.0676 217.7491 234.6088 261.2723 282.6085 294.5872 314.3615 334.6317 358.0243 392.9910 402.9567 412.5021 413.4008 418.1958 427.5050 436.0834 452.9628 481.1644 519.6254 526.0106 539.7309 602.4385 621.7789 624.5017 659.4213 666.2913 699.6214 718.5818 735.0879 785.6840 787.1542 802.1650 815.4700 817.0467 836.0073 858.5015 899.4430 932.1759 955.9141 956.7877 968.2252 980.6536 990.0709 1008.3973 1023.0222 1037.6126 1050.8112 1055.7295 1086.6485 1133.6887 1141.1207 1170.3353 1185.1770 1191.0494 1223.9784 1259.0636 1283.2678 1301.9734 1325.8580 1338.3860 1373.9294 1400.8865 1403.5028 1436.5014 1438.5901 1473.7072 1491.1282 1518.2974 1567.4152 1584.3807 1609.3269 1614.7187 1650.1509 3122.7591 3136.6549 3138.6557 3141.8862 3161.1870 3164.2672 3167.6290 3174.0713 3189.9342 3268.3082 3560.0087 3698.4227
redmass: 6.4829 7.8870 13.6699 3.9782 7.7476 5.9549 5.1572 7.5181 5.8257 5.9137 10.1931 7.8189 3.4782 7.8642 7.2392 6.0572 6.5409 5.5841 6.4581 7.4001 6.4792 4.2645 4.7084 3.0060 1.1157 4.5668 4.0424 1.4734 2.1783 2.7333 3.4918 5.2988 5.9728 6.7463 5.5752 4.4657 5.0805 3.2596 2.9066 4.0544 1.4554 6.6478 6.8998 4.6592 1.4176 1.8560 4.2083 1.3470 1.5017 5.5783 1.5129 1.4197 4.9183 1.3543 1.3442 1.4448 3.5814 2.6088 2.7590 4.8954 1.1942 1.8831 1.3119 1.1522 2.8435 1.6254 1.4222 1.6270 1.2927 2.6058 3.4104 3.3937 5.1966 3.1053 2.9119 3.9564 2.7598 2.9553 6.1970 6.2894 7.3243 6.4934 4.7893 1.2268 1.0904 1.0893 1.0891 1.0870 1.0914 1.0958 1.0967 1.0961 1.0964 1.0753 1.0454 1.1040
irintensity: 1.3664 1.5915 0.1958 0.1366 1.2915 2.1230 4.9674 2.0125 0.7684 2.5109 14.6702 5.6447 36.6351 8.5702 11.3219 14.5742 6.7722 13.4739 8.2289 6.1413 17.4865 7.1010 52.3718 18.0798 1.1943 64.0917 38.6647 450.7849 61.1607 21.9562 15.4712 71.5091 6.3006 1.9082 5.5413 85.9158 32.9654 441.5523 9.5498 9.4234 49.9069 29.4423 39.8413 80.6817 13.2780 75.8410 62.1247 1.6869 39.1300 47.9306 7.1231 2.3303 9.2528 5.6599 0.5850 1.6255 3.2493 76.7853 20.5458 46.7895 13.3631 0.7275 95.7413 105.3875 244.8809 48.4963 10.2720 5.6484 4.7587 82.6728 79.3891 17.5329 3.6287 114.6896 0.7478 2.1354 43.8842 66.1761 117.9085 71.1114 7.0217 11.3999 194.0170 282.5152 23.2415 10.5951 12.9010 3.6626 9.7783 1.7984 10.9390 8.3352 7.8712 18.9591 133.4791 26.9047
temp: 298.150 k
press: 1.00000 atm
elementType: 16 8 8 8 8 7 7 7 7 6 6 6 6 6 6 6 6 6 6 6 6 6 1 1 1 1 1 1 1 1 1 1 1 1
symmnumber: 1
zpe: 626756.4 jmol-1
zpe.correction: 0.238719 hartree
zpe.thermalcorrener: 0.259717 hartree
zpe.thermalcorrenthalpy: 0.260661 hartree
zpe.thermalcorrgfe: 0.184626 hartree
zpe.sumelectzpe: -1418.679707 hartree
zpe.sumelectthermal: -1418.658710 hartree
zpe.sumelectthermalent: -1418.657765 hartree
zpe.sumelectthermalfe: -1418.733800 hartree
dipole: 6.0519 8.4302 -1.5889
dipole: 10.4985
quadrupole: -124.6816 -124.5485 -139.2320
quadrupole: 14.6728 -31.4802 5.7459
quadrupole: 4.8058 4.9389 -9.7446 14.6728 -31.4802 5.7459
hfenergy: -1418.9184262 hartree
pointgroup: C01 [X(C13H12N4O4S1)]
dipole: 1.6876109 2.959976 2.334711 debye
polarizability: 372.8312809|-7.6736011|177.1854589|24.4905375|40.2827052|226.2617769 unknown
InChI: InChI=1S/C13H12N4O4S/c14-11-5-7-12(8-6-11)22(20,21)16-15-9-10-3-1-2-4-13(10)17(18)19/h1-9,16H,14H2
charge 0 multiplicity 1
34 atoms
S  2.016334 -1.955864 -0.31554
O  1.341871 -2.778743 0.910623
O  2.968804 -2.649046 -1.437629
O  -5.521741 0.342848 -3.251885
O  -3.51258 -0.655845 -3.587222
N  0.622592 -1.257432 -1.469688
N  -0.49683 -0.865511 -0.8506
N  4.620857 3.016786 1.905583
N  -4.387549 -0.096293 -2.811366
C  2.806573 -0.423947 0.358152
C  2.411719 0.028311 1.631125
C  3.786792 0.22532 -0.416544
C  4.019381 1.876494 1.393966
C  3.023042 1.181542 2.148359
C  4.394593 1.376963 0.106999
C  -2.821634 -0.244573 -0.776308
C  -4.099154 0.048237 -1.361488
C  -2.714433 -0.046754 0.636778
C  -1.639986 -0.720535 -1.510007
C  -5.189979 0.505668 -0.577327
C  -3.792165 0.399515 1.414211
C  -5.043976 0.679933 0.806409
H  1.659888 -0.524539 2.202904
H  4.076918 -0.174411 -1.393405
H  2.73514 1.55119 3.138978
H  5.164638 1.89603 -0.474656
H  0.624912 -1.815475 -2.34999
H  -1.746122 -0.266805 1.094867
H  -1.732394 -0.929495 -2.581909
H  -6.13576 0.714201 -1.082796
H  -3.665535 0.527666 2.494551
H  -5.890946 1.026028 1.406828
H  5.333073 3.514189 1.378112
H  4.365256 3.377946 2.820516
