program: Gaussian 09
title: 000229181
version: EM64L-G09RevD.01
frameworkgroup: C1[X(C12H19N3O2S)]
method: RPBEPBE
basis: SDD
operation: Freq
keyword: #p
keyword: freq=noraman
keyword: PBEPBE/SDD
title: #p freq=noraman PBEPBE/SDD
converged: YES YES NO NO
title: Mulliken charges:
elementType: S O O N N N C C C C C C C C C C C C H H H H H H H H H H H H H H H H H H H
charge: 0.956573 -0.523881 -0.549814 0.033462 -0.500395 -0.687690 0.197114 0.098487 -0.693869 -0.704408 -0.694139 -0.791110 -0.077931 -0.204007 -0.211911 -0.389723 -0.387330 0.512915 0.215246 0.231040 0.205781 0.194658 0.222202 0.235734 0.205513 0.226179 0.215329 0.240175 0.253688 0.231338 0.298450 0.279236 0.277011 0.229558 0.229111 0.313839 0.313571
chargesum: 0.00000
title: Mulliken charges with hydrogens summed into heavy atoms:
elementType: S O O N N N C C C C C C C C C C C C
charge: 0.956573 -0.523881 -0.549814 0.033462 -0.201945 -0.060279 0.197114 0.098487 -0.041802 -0.051815 -0.047119 -0.065909 -0.077931 0.075229 0.065100 -0.160165 -0.158219 0.512915
polarizability: 2.59747408e+02 1.82525629e+01 1.90999638e+02 8.73662139e+00 -1.11550423e+01 1.54115935e+02
1716.lowfreq: -8.1732 -0.0014 0.0008 0.0013 5.2159 9.4677 16.6057 20.9827 36.8155
frequency: 12.8851 20.3887 36.6565 51.3470 70.2402 93.8757 104.6882 129.8586 135.2446 169.0212 180.6116 189.0160 221.2450 233.3245 250.0638 260.1402 273.5644 288.9915 307.9959 341.2678 346.8784 365.9957 379.2904 399.3415 405.7781 407.6553 414.5271 421.4762 430.9770 451.8136 493.3463 522.7979 549.0465 573.0140 603.8295 623.8816 666.6355 721.5500 797.0773 801.5492 813.6764 816.5352 834.7050 845.4556 917.9000 932.7968 943.2276 945.6867 953.1620 957.4176 968.3994 983.7633 999.3191 1006.0583 1020.5559 1030.4176 1054.8651 1059.2074 1129.6490 1147.6618 1182.3471 1202.7524 1226.4809 1279.3976 1299.6080 1306.7961 1321.3830 1371.5787 1372.9516 1385.5236 1401.3473 1402.0645 1436.2374 1451.0407 1458.9952 1461.8804 1464.2439 1467.0147 1481.1669 1484.7348 1491.0328 1496.0304 1572.2260 1587.3292 1615.5432 1646.3286 2953.7299 2973.4578 2976.6503 2985.6298 3028.2156 3068.3237 3072.7993 3075.8217 3079.9996 3083.6461 3097.5732 3113.6247 3132.8016 3134.9870 3163.2639 3167.4780 3217.1422 3564.0147 3703.2506
redmass: 4.5514 2.9097 3.6570 3.6702 5.2256 2.4566 1.6349 5.4158 5.2604 1.9009 6.2526 1.5722 2.5122 3.1056 1.0576 1.7614 2.1154 4.4482 4.8995 2.6971 2.5061 3.1894 2.9287 7.8763 2.4915 1.1285 2.9393 1.5253 2.8540 4.7316 4.1405 2.7179 2.6556 3.2227 6.0717 6.9105 3.0017 2.9160 2.9035 5.2878 5.8720 1.2604 1.8467 2.2277 1.7393 1.6551 4.9136 1.2153 1.8805 1.6197 1.3922 4.6718 1.4085 1.6702 1.4425 1.5280 2.3530 2.4651 1.1902 2.4060 1.1167 2.8522 3.2564 1.3825 1.2901 2.7233 2.6176 1.1937 1.2021 1.2028 5.5726 1.2048 3.7779 1.0490 1.0671 1.0473 1.0511 1.0488 1.0519 1.0576 2.9786 1.0852 9.3184 7.4675 4.6598 1.2376 1.0439 1.0344 1.0348 1.0361 1.0925 1.0998 1.0993 1.1009 1.0998 1.0990 1.0995 1.0951 1.0894 1.0893 1.0955 1.0961 1.0735 1.0451 1.1040
irintensity: 1.9904 0.9063 0.1059 1.5072 1.2077 1.0329 1.2993 0.6296 0.5719 3.6928 4.8627 0.4947 5.9825 7.7452 0.0540 5.7018 0.1713 21.4520 1.8512 7.2518 0.1546 2.2609 24.0094 42.4892 1.9301 0.9551 0.5593 169.5648 180.6523 81.7514 13.8277 37.0330 6.2738 4.2205 13.6219 0.3817 62.3298 0.3448 95.6730 31.5145 58.2307 1.0253 66.5127 96.1742 1.8750 4.7480 58.1904 0.7808 10.4675 3.9261 0.8506 6.5825 1.0958 2.7144 1.5188 2.2761 35.3400 29.6195 12.0281 57.3951 44.1028 7.0846 4.2411 13.4618 4.2238 15.2928 69.1130 17.0566 13.7220 48.0359 4.9259 3.0895 1.9920 5.0563 9.0451 9.5389 1.6881 0.4630 22.3435 29.8527 70.7745 24.4286 32.6775 7.9634 161.4478 277.9907 15.5179 29.9449 43.6392 27.4146 17.0738 1.2159 43.7495 15.1183 24.8094 91.0624 28.5736 27.0914 13.7701 15.3301 3.1324 8.9687 8.5838 111.3282 24.8206
temp: 298.150 k
press: 1.00000 atm
elementType: 16 8 8 7 7 7 6 6 6 6 6 6 6 6 6 6 6 6 1 1 1 1 1 1 1 1 1 1 1 1 1 1 1 1 1 1 1
symmnumber: 1
zpe: 774975.5 jmol-1
zpe.correction: 0.295173 hartree
zpe.thermalcorrener: 0.316238 hartree
zpe.thermalcorrenthalpy: 0.317182 hartree
zpe.thermalcorrgfe: 0.243812 hartree
zpe.sumelectzpe: -1179.857693 hartree
zpe.sumelectthermal: -1179.836628 hartree
zpe.sumelectthermalent: -1179.835683 hartree
zpe.sumelectthermalfe: -1179.909054 hartree
dipole: -1.1953 -6.2147 -3.1892
dipole: 7.0868
quadrupole: -79.1522 -119.7080 -117.8591
quadrupole: 22.1129 2.6085 -7.8633
quadrupole: 26.4209 -14.1349 -12.2860 22.1129 2.6085 -7.8633
hfenergy: -1180.1528658 hartree
pointgroup: C01 [X(C12H19N3O2S1)]
dipole: -0.4223025 2.537103 1.0763438 debye
polarizability: 258.9655242|-20.3530626|190.255365|-6.3607519|-13.6933949|155.6420908 unknown
InChI: InChI=1S/C12H19N3O2S/c1-9(12(2,3)4)14-15-18(16,17)11-7-5-10(13)6-8-11/h5-8,15H,13H2,1-4H3
charge 0 multiplicity 1
37 atoms
S  -0.72976 -1.820829 -0.325626
O  -0.256928 -1.884861 -1.881838
O  -1.238925 -3.144827 0.479239
N  1.512161 -0.292992 0.186605
N  0.723924 -1.227591 0.832049
N  -4.827486 2.587175 0.229733
C  3.561755 1.01439 -0.119443
C  2.748061 -0.076956 0.593807
C  4.845023 0.369572 -0.728133
C  2.741277 1.669953 -1.257763
C  3.970133 2.109525 0.912261
C  3.355006 -0.860398 1.747059
C  -1.968189 -0.453784 -0.144056
C  -2.012152 0.552429 -1.126209
C  -2.842378 -0.483168 0.958013
C  -2.972449 1.570046 -0.998703
C  -3.800964 0.535984 1.080231
C  -3.87851 1.579639 0.106155
H  5.45127 1.148418 -1.226754
H  4.578669 -0.393883 -1.481191
H  5.479497 -0.108111 0.040666
H  3.357856 2.43429 -1.767111
H  1.830756 2.152831 -0.863487
H  2.421242 0.918108 -1.999015
H  4.574398 1.697986 1.741556
H  3.075306 2.59349 1.34406
H  4.575085 2.887955 0.411007
H  4.380371 -0.535559 1.976375
H  2.738389 -0.7452 2.660009
H  3.394032 -1.946981 1.519674
H  1.165337 -2.126781 1.136015
H  -1.319665 0.522645 -1.973221
H  -2.781952 -1.297207 1.687404
H  -3.026679 2.362818 -1.753593
H  -4.496399 0.530055 1.927391
H  -4.896526 3.327382 -0.462679
H  -5.481892 2.595835 1.006808
