program: Gaussian 09
title: 000229180
version: EM64L-G09RevD.01
frameworkgroup: C1[X(C12H17N3O4S)]
method: RPBEPBE
basis: SDD
operation: Freq
keyword: #p
keyword: freq=noraman
keyword: PBEPBE/SDD
title: #p freq=noraman PBEPBE/SDD
converged: YES YES NO NO
title: Mulliken charges:
elementType: S O O O O N N N C C C C C C C C C C C C H H H H H H H H H H H H H H H H H
charge: 0.963093 -0.505385 -0.527850 -0.195778 -0.195720 0.025578 -0.493373 0.026864 0.188615 0.106678 -0.690732 -0.700539 -0.689420 -0.787309 -0.056948 -0.176685 -0.206862 -0.339590 -0.331155 0.395383 0.208084 0.230580 0.220444 0.203269 0.221042 0.229161 0.220344 0.227024 0.207527 0.246491 0.257423 0.232517 0.303790 0.293512 0.293876 0.298150 0.297903
chargesum: 0.00000
title: Mulliken charges with hydrogens summed into heavy atoms:
elementType: S O O O O N N N C C C C C C C C C C C C
charge: 0.963093 -0.505385 -0.527850 -0.195778 -0.195720 0.025578 -0.189584 0.026864 0.188615 0.106678 -0.031624 -0.047067 -0.034526 -0.050879 -0.056948 0.116827 0.087014 -0.041440 -0.033252 0.395383
polarizability: 2.57614908e+02 4.61068024e+00 2.03145853e+02 8.69298723e+00 -1.68157027e+01 1.60529328e+02
1716.lowfreq: -0.0002 0.0010 0.0016 0.6281 5.0802 8.6105 15.1773 27.5820 29.7050
frequency: 14.8273 27.4542 29.6543 48.5613 63.9208 69.3959 83.4528 105.4159 114.7996 123.2061 162.7293 171.4070 191.5686 200.5299 226.4264 229.8525 251.9515 263.7314 275.8342 281.9037 328.4732 342.7740 347.8382 363.4948 369.6746 386.5605 403.2330 411.1241 438.0924 474.0098 493.0446 506.1123 506.4051 549.1866 574.9538 612.5990 662.6530 664.0397 681.1487 736.7780 782.4539 796.6341 812.7898 844.6023 853.8367 871.3125 922.3970 932.5626 942.7516 949.7671 952.6751 992.1397 994.3322 1000.1181 1000.7820 1006.1660 1032.2654 1049.2824 1053.3381 1086.0575 1104.9419 1146.9509 1171.0910 1202.3883 1217.2984 1225.3430 1278.4277 1282.4709 1304.6551 1369.5809 1374.3642 1377.0536 1387.4820 1392.7988 1406.2884 1424.0942 1452.3118 1453.0736 1458.8395 1464.1944 1465.0001 1468.8311 1483.4032 1485.3218 1498.1502 1573.2867 1582.5549 1607.6690 2957.3054 2977.1994 2979.9105 2988.4832 3032.0839 3073.1791 3076.5827 3078.9503 3082.5822 3086.7543 3095.8042 3120.4455 3163.4484 3170.1983 3188.8352 3191.0882 3217.1458
redmass: 5.5790 3.1334 5.2005 3.8756 6.3247 6.0518 4.8374 1.3155 8.7692 4.4268 3.3645 3.5541 1.8439 7.8106 6.1462 1.9095 1.0729 1.9191 2.7796 1.7844 3.9797 3.0296 2.8798 3.3853 10.5297 3.9381 3.7646 2.8705 4.0861 6.8327 4.2863 5.1268 5.5570 2.6659 3.1591 7.0962 4.6296 3.1605 8.2053 4.2356 8.2725 2.5546 11.1790 2.1769 1.2461 1.5654 1.7499 1.6617 2.1562 1.2199 9.7365 1.3952 4.7160 1.4457 1.3810 1.7006 1.5311 2.1769 2.0763 4.2236 1.2831 2.4212 1.2304 2.8162 8.7714 3.2152 1.3909 1.2453 2.6579 6.7372 1.1847 1.2107 1.1990 5.5237 1.2003 6.7940 2.1551 1.0527 1.0665 1.0475 1.0507 1.0491 1.0508 1.0578 1.0844 9.3572 6.2467 8.4687 1.0441 1.0345 1.0348 1.0356 1.0927 1.0996 1.0995 1.1009 1.1001 1.0993 1.0996 1.0947 1.0909 1.0903 1.0954 1.0968 1.0738
irintensity: 0.0864 0.2869 0.0070 0.8538 0.9272 0.4660 4.8873 2.1886 4.7965 1.6750 9.4904 1.1603 0.5079 5.8704 4.1774 0.6412 0.2727 5.9207 0.4842 2.6951 8.5490 6.1428 2.8719 21.4630 54.4436 10.0204 30.5635 0.0476 1.9551 25.9121 10.8936 40.9272 24.9534 7.4176 2.8777 0.1769 34.3621 26.5247 34.4442 5.2646 47.4955 45.5213 93.3471 50.1448 1.5453 53.0146 1.6672 3.6221 21.9508 1.2190 53.1978 4.1815 3.6843 1.5680 0.0294 2.1548 1.9264 28.3616 4.3160 4.4736 8.8442 50.3169 12.2510 6.2559 262.2768 3.9634 6.5199 0.1756 6.2223 58.7173 21.4723 9.8686 41.9670 64.7872 3.7827 41.7440 8.2295 5.3724 9.2280 6.0276 0.5988 0.3586 24.3962 32.3579 25.5692 53.5447 16.4248 0.2650 12.5951 28.5426 40.7509 18.5576 14.4911 2.8930 36.8738 12.2837 20.5957 89.2908 30.0365 22.4948 4.3262 3.7838 3.3300 0.9102 15.7706
temp: 298.150 k
press: 1.00000 atm
elementType: 16 8 8 8 8 7 7 7 6 6 6 6 6 6 6 6 6 6 6 6 1 1 1 1 1 1 1 1 1 1 1 1 1 1 1 1 1
symmnumber: 1
zpe: 734524.7 jmol-1
zpe.correction: 0.279766 hartree
zpe.thermalcorrener: 0.301982 hartree
zpe.thermalcorrenthalpy: 0.302926 hartree
zpe.thermalcorrgfe: 0.226278 hartree
zpe.sumelectzpe: -1328.874815 hartree
zpe.sumelectthermal: -1328.852599 hartree
zpe.sumelectthermalent: -1328.851655 hartree
zpe.sumelectthermalfe: -1328.928303 hartree
dipole: 5.5158 -1.8027 -2.1856
dipole: 6.2008
quadrupole: -129.3978 -144.3580 -127.7494
quadrupole: -14.1905 -7.3074 -8.0040
quadrupole: 4.4372 -10.5229 6.0857 -14.1905 -7.3074 -8.0040
hfenergy: -1329.1545804 hartree
pointgroup: C01 [X(C12H17N3O4S1)]
dipole: 2.1122346 0.8594763 0.8668102 debye
polarizability: 258.254772|-1.8597972|200.8817343|-5.4245951|-19.4162171|162.1535821 unknown
InChI: InChI=1S/C12H17N3O4S/c1-9(12(2,3)4)13-14-20(18,19)11-7-5-10(6-8-11)15(16)17/h5-8,14H,1-4H3
charge 0 multiplicity 1
37 atoms
S  0.345594 -2.350954 -0.281242
O  0.843552 -2.358449 -1.829245
O  0.055302 -3.719668 0.547194
O  -4.710198 2.181553 -0.851282
O  -5.42442 1.042455 0.991706
N  1.985153 -0.220832 0.230303
N  1.546667 -1.360663 0.887743
N  -4.581831 1.257291 0.039132
C  3.482828 1.689933 -0.08513
C  3.082166 0.391439 0.631566
C  4.901228 1.503447 -0.706768
C  2.481543 2.042467 -1.212877
C  3.516003 2.856467 0.948998
C  3.917626 -0.14366 1.782607
C  -1.164121 -1.226592 -0.172426
C  -1.308882 -0.226504 -1.14723
C  -2.083038 -1.461996 0.862923
C  -2.448839 0.600485 -1.07603
C  -3.223797 -0.636243 0.931067
C  -3.379009 0.381011 -0.036464
H  5.664786 1.258448 0.053781
H  4.895637 0.699077 -1.464307
H  5.212705 2.440671 -1.203326
H  2.802176 2.974536 -1.713814
H  1.465005 2.191123 -0.809473
H  2.429232 1.236551 -1.964883
H  3.820843 3.790945 0.442996
H  2.517047 3.01689 1.393425
H  4.233481 2.671297 1.769168
H  4.784104 0.497263 1.998887
H  3.305746 -0.225022 2.702016
H  4.305191 -1.160311 1.559839
H  2.259905 -2.067484 1.184463
H  -0.561315 -0.112286 -1.937436
H  -1.916283 -2.274431 1.576898
H  -2.62615 1.400429 -1.798959
H  -3.98204 -0.764584 1.707379
