program: Gaussian 09
title: 000229178
version: EM64L-G09RevD.01
frameworkgroup: C1[X(C12H15N3O4S)]
method: RPBEPBE
basis: SDD
operation: Freq
keyword: #p
keyword: freq=noraman
keyword: PBEPBE/SDD
title: #p freq=noraman PBEPBE/SDD
converged: YES YES NO NO
title: Mulliken charges:
elementType: S O O O O N N N C C C C C C C C C C C C H H H H H H H H H H H H H H H
charge: 0.928255 -0.522788 -0.537282 -0.197592 -0.196907 -0.418516 -0.026422 0.026803 -0.092724 -0.178318 -0.200880 0.394841 -0.332320 -0.331211 0.159701 0.449949 -0.404352 -0.775996 -0.804065 -0.782336 0.288047 0.292720 0.279744 0.295915 0.296715 0.222264 0.229958 0.245052 0.257357 0.229127 0.235816 0.238419 0.215969 0.234609 0.280449
chargesum: 0.00000
title: Mulliken charges with hydrogens summed into heavy atoms:
elementType: S O O O O N N N C C C C C C C C C C C C
charge: 0.928255 -0.522788 -0.537282 -0.197592 -0.196907 -0.138772 -0.026422 0.026803 -0.092724 0.109730 0.091840 0.394841 -0.036405 -0.034496 0.159701 0.449949 -0.182087 -0.043629 -0.100703 -0.051309
polarizability: 3.35677772e+02 3.72747608e+01 2.30507177e+02 5.62625760e+00 -1.78126076e+01 1.46080640e+02
1716.lowfreq: -8.8827 -2.9727 -0.0011 -0.0008 0.0021 1.4824 7.0003 19.4005 24.8811
frequency: 6.3712 18.9541 24.7397 38.4023 53.7434 66.3056 74.5459 86.4319 108.6787 118.3695 129.9243 136.3118 148.3622 174.6272 195.4320 198.6376 220.4765 236.5881 256.4033 317.4905 337.7498 344.1695 352.3952 361.8297 395.1530 411.4091 419.9520 467.2810 470.9822 491.8106 505.7266 516.7996 564.4960 612.7072 650.2193 663.6875 680.3860 737.6103 781.5546 790.1438 791.7960 831.4314 850.3082 852.8654 862.1911 872.3471 927.7383 958.3504 973.8384 987.4373 992.7311 994.3065 1001.2752 1026.1809 1046.5293 1050.0989 1074.9429 1086.3370 1091.1341 1104.2478 1170.8641 1217.6295 1221.1409 1266.2165 1281.8723 1289.2531 1369.5844 1380.8392 1388.6302 1393.6835 1396.4640 1398.6731 1421.9454 1445.6033 1451.7655 1453.7821 1455.5612 1460.2747 1467.4716 1471.9153 1501.1070 1582.1909 1606.0847 1621.4558 2956.0989 2961.9102 2970.0867 3034.3463 3038.6344 3043.8034 3083.6973 3089.6706 3094.5387 3109.4600 3117.6130 3162.8012 3165.4062 3188.0824 3190.1840
redmass: 5.9506 3.3406 5.1492 5.3365 3.4640 6.4806 4.3583 4.7924 6.9042 1.3554 5.3316 5.0547 1.5846 1.6246 4.1933 1.5890 5.7697 4.2456 7.1762 3.4354 3.2607 5.9453 8.1615 4.9763 5.7140 2.8732 3.6872 4.3666 3.4893 3.7785 7.2370 4.6689 2.7642 7.0971 3.7087 5.0005 8.0349 4.2058 10.2643 8.1945 3.4259 2.4167 1.2751 1.2581 1.9106 1.7082 10.5059 1.2430 1.4711 1.4837 1.4058 4.5853 1.3759 1.5799 2.2885 1.9132 1.7116 4.0212 2.7878 1.2798 1.2289 8.4154 2.8299 1.3182 1.2484 2.4962 6.6425 1.3885 1.2616 5.6348 1.3658 1.2570 6.8983 1.0761 2.0725 1.2565 1.0784 1.1304 1.0561 1.1318 3.1768 6.2314 8.4316 5.9364 1.0446 1.0373 1.0378 1.0959 1.0901 1.0935 1.1010 1.0989 1.0738 1.0948 1.0921 1.0907 1.0905 1.0952 1.0964
irintensity: 1.0718 1.9341 0.0343 1.7520 0.6676 0.1935 5.9692 2.6073 2.2501 7.7910 49.2650 1.0430 10.7819 6.0037 4.7517 3.2224 3.8503 0.3195 6.3203 25.5979 1.2843 13.5324 58.2937 11.2918 16.4782 0.0013 8.5211 33.2578 3.5931 36.4193 2.1180 25.4440 10.0657 0.0492 2.1152 21.7493 28.3458 8.0721 61.1434 85.9474 24.4861 48.4176 14.5483 1.0189 61.6350 48.7175 45.5554 2.0248 2.1014 8.4667 7.1869 8.6246 0.2644 28.4168 21.0718 10.6043 13.3905 5.7861 19.8183 11.5292 11.7913 300.8146 7.4434 8.3682 0.3754 18.1137 58.2013 6.3374 55.4457 49.4493 7.9157 11.6829 41.8382 12.4825 21.0266 73.8555 21.2816 44.6695 24.3613 15.6188 161.2200 35.4297 0.8752 172.0575 13.1749 25.6662 14.5203 14.5944 23.1129 18.1255 27.8039 31.7516 47.9655 0.9683 52.0742 4.6795 4.4658 2.4164 0.6550
temp: 298.150 k
press: 1.00000 atm
elementType: 16 8 8 8 8 7 7 7 6 6 6 6 6 6 6 6 6 6 6 6 1 1 1 1 1 1 1 1 1 1 1 1 1 1 1
symmnumber: 1
zpe: 672679.8 jmol-1
zpe.correction: 0.256210 hartree
zpe.thermalcorrener: 0.278422 hartree
zpe.thermalcorrenthalpy: 0.279366 hartree
zpe.thermalcorrgfe: 0.200214 hartree
zpe.sumelectzpe: -1327.690782 hartree
zpe.sumelectthermal: -1327.668570 hartree
zpe.sumelectthermalent: -1327.667626 hartree
zpe.sumelectthermalfe: -1327.746778 hartree
dipole: 6.0670 0.9553 2.6206
dipole: 6.6775
quadrupole: -128.4333 -129.0969 -130.1868
quadrupole: 14.1559 12.0031 -13.7410
quadrupole: 0.8057 0.1421 -0.9478 14.1559 12.0031 -13.7410
hfenergy: -1327.946992 hartree
pointgroup: C01 [X(C12H15N3O4S1)]
dipole: 2.1712481 -1.1867657 -0.8827008 debye
polarizability: 305.1771593|-61.2631992|255.6688583|-2.4693797|-29.0110032|151.4195709 unknown
InChI: InChI=1S/C6H11N2.C6H4NO4S/c1-5(2)4-6(3)8-7;8-7(9)5-1-3-6(4-2-5)12(10)11/h4,7H,1-3H3;1-4H
charge 0 multiplicity 1
35 atoms
S  0.490956 1.673261 0.610095
O  0.889209 0.859411 1.972215
O  0.615406 3.299443 0.472806
O  -5.74194 -0.954903 -0.266438
O  -6.00292 1.022839 -1.372594
N  1.506153 0.843975 -1.055177
N  2.02239 -0.341872 -0.674454
N  -5.302906 0.18117 -0.69084
C  -1.294592 1.212161 0.207676
C  -1.779751 -0.021161 0.674347
C  -2.061103 2.126573 -0.53409
C  -3.893398 0.544299 -0.374004
C  -3.114413 -0.363818 0.376276
C  -3.396743 1.78535 -0.82977
C  3.182038 -0.832415 -1.132627
C  3.22406 -2.863418 0.418768
C  3.6949 -2.102087 -0.634449
C  3.951095 -0.096524 -2.2195
C  3.928881 -4.153649 0.782452
C  2.021039 -2.498968 1.258713
H  -1.137124 -0.676709 1.269831
H  -1.628716 3.081832 -0.847347
H  2.194772 1.627536 -1.219427
H  -3.555546 -1.306396 0.709631
H  -4.049341 2.452819 -1.397894
H  4.579083 -2.473106 -1.168967
H  4.211306 0.9336 -1.895327
H  4.889734 -0.613439 -2.469683
H  3.344209 -0.00129 -3.139849
H  4.788873 -4.36769 0.125508
H  3.226186 -5.008985 0.727833
H  4.288721 -4.116345 1.82988
H  1.879822 -3.216984 2.085165
H  1.105421 -2.481881 0.635233
H  2.095541 -1.474634 1.668805
