program: Gaussian 09
title: 000229163
version: EM64L-G09RevD.01
frameworkgroup: C1[X(C7H7NO2)]
method: RPBEPBE
basis: SDD
operation: Freq
keyword: #pfreq=noraman
keyword: PBEPBE/SDD
title: #p freq=noraman PBEPBE/SDD
converged: NO YES NO NO
title: Mulliken charges:
elementType: O O N C C C C C C C H H H H H H H
charge: -0.437096 -0.250568 0.001741 0.392731 0.113879 -0.329034 -0.759497 -0.406427 -0.317190 0.110227 0.238314 0.254131 0.212762 0.253809 0.290004 0.245852 0.386362
chargesum: 0.00000
title: Mulliken charges with hydrogens summed into heavy atoms:
elementType: O O N C C C C C C C
charge: -0.050734 -0.250568 0.001741 0.392731 0.113879 -0.090719 -0.038794 -0.116423 -0.071338 0.110227
polarizability: 1.16852206e+02 1.80267221e+00 9.92135381e+01 -3.25044344e-03 1.75727775e-02 4.05108822e+01
1716.lowfreq: -4.4698 0.0002 0.0006 0.0010 9.1691 13.0871 46.0460 129.2695 170.5961
frequency: 45.9733 129.2622 170.5797 222.1347 223.1245 332.5191 375.0310 381.5086 480.0788 506.0858 538.4796 593.7969 622.2846 703.5861 728.1758 760.8445 816.4002 848.4409 949.5697 978.1968 989.9470 997.2724 1044.4113 1056.6002 1149.8557 1179.0052 1227.3999 1284.2271 1316.2396 1321.0216 1394.0964 1403.1046 1453.5108 1457.1588 1467.2141 1543.6446 1576.3549 1635.1756 2993.5897 3079.6399 3096.5401 3132.9451 3156.9447 3172.0340 3527.5152
redmass: 8.3988 3.6622 1.0822 3.6179 5.3993 3.8966 2.7900 6.5686 4.4565 3.2975 7.2817 1.2245 4.8211 4.9270 5.5286 2.9021 5.3865 1.3792 1.4150 1.4765 2.6225 2.5987 1.6085 2.0676 2.0104 1.9342 2.4499 2.0759 2.3360 4.2495 1.8758 1.1961 1.0450 1.1542 2.1710 6.3952 5.7172 8.2526 1.0365 1.0956 1.1018 1.0880 1.0970 1.0931 1.0642
irintensity: 1.9539 0.2413 1.2050 0.2795 2.6939 2.9303 8.5887 3.2787 18.7474 4.9407 1.8425 152.7537 35.1293 16.7588 2.1075 22.5844 9.7463 20.6507 4.7091 0.2771 34.0127 186.1193 12.2357 63.8175 90.9030 4.3676 6.7196 19.4069 22.9826 35.1650 11.1984 31.8934 13.6045 27.7929 24.9070 40.2799 24.2202 295.1401 11.0080 6.6115 23.7573 6.6512 29.6910 0.0363 47.4939
temp: 298.150 k
press: 1.00000 atm
elementType: 8 8 7 6 6 6 6 6 6 6 1 1 1 1 1 1 1
symmnumber: 1
zpe: 335322.4 jmol-1
zpe.correction: 0.127718 hartree
zpe.thermalcorrener: 0.136538 hartree
zpe.thermalcorrenthalpy: 0.137482 hartree
zpe.thermalcorrgfe: 0.093499 hartree
zpe.sumelectzpe: -475.425808 hartree
zpe.sumelectthermal: -475.416987 hartree
zpe.sumelectthermalent: -475.416043 hartree
zpe.sumelectthermalfe: -475.460027 hartree
dipole: -0.0050 1.6557 -0.0001
dipole: 1.6557
quadrupole: -52.6919 -60.0032 -59.1840
quadrupole: -11.6813 -0.0066 0.0010
quadrupole: 4.6012 -2.7102 -1.8910 -11.6813 -0.0066 0.0010
hfenergy: -475.5535252 hartree
pointgroup: C01 [X(C7H7N1O2)]
dipole: 0.0484703 -0.6490174 -0.0277581 debye
dipolederiv: -0.5679944 -0.4419017 -0.0155437 -0.5384362 -1.086605 -0.0165993 -0.0192381 -0.0177917 -0.4275643 -0.9510263 0.2530144 0.0234488 0.1330445 -0.7762521 -0.0219363 0.0193525 -0.0248978 -0.3117047 -0.5398124 -0.1332761 0.0000071 -0.0992575 -0.4055392 -0.0042808 0.0012767 -0.003554 -0.257334 0.3241285 -0.2842713 -0.0178388 0.0303581 0.4172662 0.0159144 -0.004991 0.0227565 0.0284738 -0.6800839 -0.0341622 0.0125301 -0.0053802 -0.3241945 -0.0140413 0.0135695 -0.0137438 0.0145151 -0.3256009 0.3109085 0.0170246 0.2802382 -0.1336338 -0.0061477 0.0156047 -0.0066121 -0.1231881 -0.0203378 0.2859308 0.0118405 0.1307849 -0.1209488 -0.0084881 0.0057437 -0.0133126 0.0014344 0.3303608 0.0374315 -0.005453 -0.0595958 0.2119871 0.0115782 -0.0097143 0.0096158 -0.0321421 0.4076681 0.0564781 -0.0065318 -0.0767281 0.310689 0.0164192 -0.0117841 0.0135647 -0.0452124 1.750446 0.1700626 -0.0240329 0.2912327 1.4640471 0.0454135 -0.0194134 0.0478377 0.2331859 0.0463681 -0.0587993 -0.0003336 -0.1075397 -0.0650239 -0.0068262 -0.0022981 -0.0076546 0.1534766 0.0586062 0.0169564 -0.0916499 0.0103041 0.0646903 -0.0109902 -0.0879272 0.0196042 -0.0003767 -0.0353552 -0.1890562 -0.0036893 -0.0656296 -0.0560443 -0.0045497 0.0007728 -0.0015165 0.1075552 0.0669585 0.0090609 0.0894096 0.0043846 0.0642545 0.0157914 0.0852925 -0.0144224 -0.0102382 0.0867219 -0.0451729 -0.0009292 -0.0711561 0.0229919 -0.0033449 -0.0020209 -0.0038315 0.1363517 -0.1158505 -0.0249024 0.0038584 -0.0073328 0.0887157 -0.0017044 0.0045951 -0.0014114 0.13371 0.1648032 0.0716988 0.0078832 0.1507087 0.3235998 -0.0062079 0.0111796 -0.0046305 0.3990579 unknown
polarizability: 116.993383|-0.3547344|98.9390672|-1.5654337|2.4395787|40.6441761 unknown
InChI: InChI=1S/C7H7NO2/c1-5-2-3-8-4-6(5)7(9)10/h2-4,9H,1H3
charge 0 multiplicity 1
17 atoms
O  2.213849 1.630027 -0.026672
O  2.569729 -0.656693 -0.129502
N  -1.862003 1.43825 0.048081
C  -0.40289 -1.052703 -0.08408
C  0.271392 0.211547 -0.045339
C  -1.820576 -1.007442 -0.053908
C  0.302624 -2.389119 -0.153266
C  -0.501707 1.406547 0.019865
C  -2.49901 0.227298 0.010339
C  1.756812 0.299747 -0.071741
H  -2.393214 -1.94046 -0.080843
H  0.986417 -2.528405 0.702147
H  -0.433407 -3.211134 -0.166182
H  0.940626 -2.461097 -1.051556
H  0.007902 2.373309 0.050374
H  -3.594077 0.264064 0.033198
H  3.208535 1.621265 -0.047914
