program: Gaussian 09
title: 000229151
version: EM64L-G09RevD.01
frameworkgroup: C1[X(C14H9BrO4)]
method: RPBEPBE
basis: SDD
operation: Freq
keyword: #p
keyword: freq=noraman
keyword: PBEPBE/SDD
title: #p freq=noraman PBEPBE/SDD
converged: YES YES NO NO
title: Mulliken charges:
elementType: Br O O O O C C C C C C C C C C C C C C H H H H H H H H H
charge: 0.028203 -0.257164 -0.258324 -0.307174 -0.237272 0.217911 0.183045 -0.406959 0.596621 -0.290521 -0.202263 -0.482859 0.212709 0.164381 -0.329288 -0.307570 -0.222395 -0.222758 -0.221619 0.333446 0.275840 0.245608 0.238628 0.269075 0.275651 0.235365 0.235232 0.234450
chargesum: 0.00000
title: Mulliken charges with hydrogens summed into heavy atoms:
elementType: Br O O O O C C C C C C C C C C C C C C
charge: 0.028203 -0.257164 -0.258324 -0.307174 -0.237272 0.217911 0.183045 -0.073513 0.596621 -0.014681 0.281973 -0.482859 0.212709 0.164381 -0.060213 -0.031919 0.012970 0.012473 0.012831
polarizability: 3.06522395e+02 1.88571279e+01 1.96974633e+02 -4.94555733e-01 -9.29094174e-01 6.97763823e+01
1716.lowfreq: -0.6246 -0.0005 -0.0003 -0.0003 2.2601 7.1864 20.3590 36.7538 58.4830
frequency: 20.0256 36.7439 58.4548 63.8403 68.3768 103.8628 144.0068 149.5484 156.4741 194.4468 257.9692 264.9191 279.5526 323.7509 351.0116 403.3311 430.0676 434.2409 440.1247 468.2338 541.2694 614.3360 641.3144 650.0060 665.9571 669.2939 678.4700 699.4993 710.2326 738.7546 794.5759 796.7169 799.6184 837.2071 853.0768 865.4403 899.2171 925.4696 958.7078 973.4379 989.6531 998.9589 1011.3515 1012.5825 1037.9340 1068.0280 1073.6682 1087.7956 1124.5407 1134.3220 1175.3046 1185.8934 1214.6851 1232.9904 1269.4153 1318.6876 1357.5680 1372.8955 1391.2482 1397.7072 1439.3888 1457.5444 1478.1308 1484.3102 1584.7009 1601.3493 1611.1023 1618.8221 1632.7734 3009.4237 3110.9986 3132.2892 3144.7533 3156.9312 3168.2034 3178.5857 3193.0572 3218.1648
redmass: 6.1694 5.3909 8.4926 4.6449 2.9256 9.2478 9.1887 6.3934 8.6494 7.6723 12.5005 7.2431 7.5230 9.9105 8.7538 2.8322 3.3949 8.0243 3.8519 6.6031 8.3133 6.4397 11.4423 8.6477 7.5186 5.1708 9.5416 1.6767 4.1435 8.1146 2.0589 5.9810 9.2065 7.1287 1.4700 1.2443 1.3630 6.7815 1.4147 5.8029 6.3099 1.3851 1.3323 4.2544 2.2790 1.4948 3.9798 1.6061 1.0834 2.1078 1.0584 1.1383 1.3333 3.7056 8.7174 1.3157 1.7523 2.8617 9.2811 5.7782 2.2677 3.1575 2.2563 1.2124 6.5379 8.6275 6.0514 10.4059 10.4204 1.0590 1.1129 1.0857 1.0892 1.0939 1.0978 1.0986 1.0937 1.0936
irintensity: 1.5698 1.0189 1.0700 1.3400 12.9334 1.3222 0.2495 0.6265 0.4329 0.8097 0.7064 1.1305 8.2163 4.7740 0.3424 0.0026 8.3118 0.4762 2.6470 11.1504 10.3068 0.9166 2.0392 14.7065 9.6133 20.6911 1.1526 81.9373 0.4594 1.7021 27.2131 30.2379 16.3117 18.6259 15.7009 0.0146 50.2463 25.3690 4.4667 136.2776 13.3297 0.0414 0.3314 319.8190 155.0885 3.9244 42.7599 10.8608 25.4484 384.3302 0.8253 44.7909 6.9256 378.5892 66.8838 0.2040 12.3845 16.9950 8.7977 47.6665 14.5898 404.7797 7.3960 30.2841 22.3814 0.0882 16.2624 41.9481 114.2175 132.4413 28.2423 0.2980 10.7978 13.2353 15.9526 17.4100 0.6983 20.1457
temp: 298.150 k
press: 1.00000 atm
elementType: 35 8 8 8 8 6 6 6 6 6 6 6 6 6 6 6 6 6 6 1 1 1 1 1 1 1 1 1
symmnumber: 1
zpe: 512225.1 jmol-1
zpe.correction: 0.195096 hartree
zpe.thermalcorrener: 0.211261 hartree
zpe.thermalcorrenthalpy: 0.212206 hartree
zpe.thermalcorrgfe: 0.148311 hartree
zpe.sumelectzpe: -851.887474 hartree
zpe.sumelectthermal: -851.871309 hartree
zpe.sumelectthermalent: -851.870364 hartree
zpe.sumelectthermalfe: -851.934259 hartree
dipole: 0.2235 0.2857 0.2805
dipole: 0.4585
quadrupole: -83.1043 -118.6562 -121.3875
quadrupole: 6.2917 -1.6677 -0.5942
quadrupole: 24.6117 -10.9402 -13.6715 6.2917 -1.6677 -0.5942
hfenergy: -852.0825701 hartree
pointgroup: C01 [X(C14H9Br1O4)]
dipole: 0.0909227 0.1335161 0.0803092 debye
polarizability: 307.5133558|15.1978858|188.0217482|-3.9063311|-30.698291|77.7383066 unknown
InChI: InChI=1S/C14H9BrO4/c15-10-6-12-13(18-8-17-12)7-11(10)19-14(16)9-4-2-1-3-5-9/h1-7H,8H2
charge 0 multiplicity 1
28 atoms
Br -0.343089 3.006914 -0.846274
O  -4.031788 -1.753188 0.261388
O  -5.042124 0.363003 -0.262257
O  0.559301 0.205309 -0.160446
O  0.967795 -2.038804 0.443755
C  -3.037071 -0.76691 0.059532
C  -3.63195 0.473549 -0.247789
C  -1.656531 -0.949935 0.110472
C  -0.85297 0.197297 -0.163868
C  -2.863434 1.605486 -0.522646
C  -5.324335 -1.017048 0.225647
C  -1.455661 1.445945 -0.473524
C  2.825584 -0.51291 0.032164
C  1.393545 -0.901926 0.137294
C  3.797065 -1.511836 0.309609
C  3.237788 0.797192 -0.329948
C  5.169062 -1.202765 0.226263
C  4.612899 1.099083 -0.411814
C  5.579797 0.103274 -0.134575
H  -1.199295 -1.90982 0.346039
H  -3.318873 2.566987 -0.765864
H  -6.001367 -1.515506 -0.484931
H  -5.734256 -0.957938 1.250675
H  3.455991 -2.514915 0.586065
H  2.48255 1.558883 -0.54181
H  5.916607 -1.973816 0.440747
H  4.931661 2.108947 -0.691126
H  6.6470 0.34325 -0.199281
