program: Gaussian 09
title: 000229140
version: EM64L-G09RevD.01
frameworkgroup: C1[X(C18H32O3)]
method: RPBEPBE
basis: SDD
operation: Freq
keyword: #pfreq=noraman
keyword: PBEPBE/SDD
title: #p freq=noraman PBEPBE/SDD
converged: NO YES NO NO
title: Mulliken charges:
elementType: O O O C C C C C C C C C C C C C C C C C C H H H H H H H H H H H H H H H H H H H H H H H H H H H H H H H H
charge: -0.263593 -0.278678 -0.243475 -0.026387 -0.450877 -0.445357 -0.432636 -0.381018 -0.235697 -0.435934 -0.381871 -0.208490 -0.398807 -0.504040 0.261423 -0.320743 -0.370456 -0.245372 -0.240721 -0.347184 -0.685186 0.195467 0.212323 0.193527 0.209221 0.199532 0.203264 0.202104 0.208207 0.184043 0.203328 0.209109 0.208860 0.188556 0.236130 0.198803 0.213987 0.206656 0.239541 0.221272 0.238326 0.243354 0.208395 0.205676 0.182075 0.184655 0.220954 0.192795 0.193258 0.191787 0.211492 0.215974 0.212430
chargesum: 0.00000
title: Mulliken charges with hydrogens summed into heavy atoms:
elementType: O O O C C C C C C C C C C C C C C C C C C
charge: -0.263593 -0.278678 -0.243475 0.169080 -0.045027 -0.036604 -0.027268 0.011232 -0.032369 -0.017965 0.042814 -0.009687 0.021836 -0.043227 0.261423 0.160936 0.043615 0.121358 0.173028 0.037861 -0.045291
polarizability: 2.53990072e+02 -3.34320615e+00 1.92392442e+02 -9.19536234e-01 -8.05708544e+00 1.67930731e+02
1716.lowfreq: -6.3582 -0.0012 0.0005 0.0013 4.2445 4.5893 10.7756 20.0247 26.0644
frequency: -5.3609 19.8271 25.1683 32.1772 35.6791 38.8540 56.8003 64.1318 82.9080 87.0823 91.5889 97.9485 113.7080 122.3792 129.6923 155.9463 161.7987 203.0634 218.6966 234.2818 240.0274 261.2453 269.2286 285.9825 333.9086 338.9458 359.8631 386.9226 442.7815 454.1023 471.1948 486.2092 499.5213 537.4057 607.4673 675.2450 698.3504 721.5412 725.3628 741.4543 746.8377 782.3948 806.9722 808.6327 826.3352 860.8374 863.3182 871.0159 889.5586 910.5959 928.8065 933.4605 937.6660 955.9382 962.0635 976.9465 995.6775 1013.2765 1026.2188 1041.4820 1043.4650 1056.8176 1064.7730 1073.2606 1079.3347 1082.8275 1091.2989 1096.1572 1105.2077 1114.1613 1118.7881 1128.4899 1144.3987 1151.8488 1154.0444 1198.6766 1201.0959 1210.8772 1216.1160 1224.7561 1231.9787 1242.3631 1267.6583 1270.1553 1271.7500 1272.5896 1274.4200 1283.5321 1290.9941 1298.7131 1307.3796 1314.6027 1316.7317 1326.1180 1335.1584 1340.2176 1340.9730 1347.1354 1356.8757 1364.4363 1368.2115 1384.3144 1389.5680 1407.0364 1450.9193 1455.9537 1456.6949 1458.9346 1464.9546 1468.7050 1470.3587 1471.2375 1473.8451 1474.7025 1477.6661 1481.0983 1485.4672 1489.4112 1496.7566 1641.9409 1670.2807 2909.4801 2910.8710 2936.2269 2950.1876 2950.8487 2956.1499 2959.3257 2964.7312 2966.6569 2966.8018 2974.7077 2975.2505 2975.5884 2992.3548 2992.4008 2995.9538 3005.5059 3006.8116 3009.8251 3018.5506 3027.1010 3033.2246 3040.1671 3044.8176 3054.2923 3055.5104 3073.0366 3073.2127 3074.4814 3088.5388 3111.1585 3128.7967
redmass: 5.3220 3.3321 3.0565 3.3034 3.1778 2.6172 3.7016 3.6679 2.8180 3.1677 2.6137 1.8283 3.0188 2.6572 2.4395 2.2537 3.4169 3.5216 3.5432 1.1183 3.9159 1.8978 2.8916 3.1345 2.5212 3.2260 3.1620 3.5897 2.6286 2.7593 3.0454 3.9215 3.1969 2.6984 4.2938 1.7290 3.0074 1.5174 1.2358 1.0722 1.8111 2.1695 1.1786 1.6596 1.2695 2.5833 1.5537 2.3609 2.3957 1.8230 2.6623 2.3426 1.1530 2.5744 3.1325 1.2482 3.3299 1.5913 4.1593 2.5091 2.4515 2.3282 6.2722 2.4526 2.8359 1.7682 2.2337 2.1266 1.7455 1.6234 1.5146 2.6739 1.6010 1.5104 1.4168 1.2461 1.3943 1.3585 1.3525 1.2643 1.3379 1.2928 1.2116 1.1692 1.2550 1.2762 1.1517 1.0794 1.0949 1.1957 1.2858 1.2834 1.2358 1.4027 1.4582 1.6811 1.5266 1.4418 1.5010 1.4884 1.5037 1.5460 1.2135 1.4688 1.1013 1.0893 1.0953 1.0795 1.0676 1.0911 1.0740 1.0888 1.0670 1.0921 1.0424 1.0699 1.0994 1.0854 1.0814 9.3511 6.9673 1.0810 1.0547 1.0557 1.0609 1.0637 1.0609 1.1057 1.0632 1.0586 1.0622 1.0363 1.0631 1.0620 1.1055 1.0595 1.0963 1.0927 1.0717 1.1004 1.0915 1.0988 1.0969 1.1036 1.0582 1.1023 1.1037 1.0843 1.1010 1.0995 1.1014 1.0979 1.1082
irintensity: 0.5358 0.5107 0.0859 0.7838 1.0360 0.9435 0.6240 0.9452 1.0266 0.5947 1.0559 0.0304 0.1526 3.6811 2.2319 0.7316 0.4935 2.0191 0.3681 0.0467 0.2551 0.8862 2.1671 15.2621 0.4920 2.1751 6.7986 1.7518 1.1033 1.3554 5.1090 14.7585 0.1099 3.7428 1.7635 26.2514 9.3502 11.9697 10.9303 8.8406 6.5544 4.8573 1.1135 3.3315 0.5844 0.5689 1.2224 20.5706 13.9529 1.5477 15.2298 4.4027 0.8469 5.5927 25.5261 0.2081 12.7804 16.6345 28.3949 47.5383 6.6948 93.3439 187.8576 2.8283 6.6193 8.3605 4.7317 21.7931 1.7269 19.7049 0.1479 2.3150 64.3118 4.8479 69.5232 3.0154 31.3561 1.1788 30.0927 15.2243 10.6862 16.4772 8.7392 2.1105 0.5741 0.8234 6.7787 0.0498 3.7872 13.4193 2.0086 13.7894 4.2316 8.2512 2.8053 1.8485 3.7292 1.7278 0.4877 11.8024 20.0078 0.2905 7.9434 1.4117 16.5084 9.2366 11.8114 3.7078 2.0478 2.4322 2.3534 6.0973 1.1557 6.1175 12.7006 11.3814 15.0037 7.3478 8.4742 143.1227 3.7860 21.6551 45.5679 64.8393 3.4299 43.0813 30.8845 50.5249 32.7614 37.5463 6.8768 34.6710 84.0982 24.8296 34.9709 43.5047 0.2018 54.4006 5.0246 6.4481 39.4716 3.9178 55.5386 73.1163 29.1513 108.4813 23.0237 13.1906 97.1492 52.4220 16.8339 56.3069 12.9426
temp: 298.150 k
press: 1.00000 atm
elementType: 8 8 8 6 6 6 6 6 6 6 6 6 6 6 6 6 6 6 6 6 6 1 1 1 1 1 1 1 1 1 1 1 1 1 1 1 1 1 1 1 1 1 1 1 1 1 1 1 1 1 1 1 1
symmnumber: 1
zpe: 1228668.5 jmol-1
zpe.correction: 0.467975 hartree
zpe.thermalcorrener: 0.492097 hartree
zpe.thermalcorrenthalpy: 0.493041 hartree
zpe.thermalcorrgfe: 0.409950 hartree
zpe.sumelectzpe: -929.056829 hartree
zpe.sumelectthermal: -929.032707 hartree
zpe.sumelectthermalent: -929.031763 hartree
zpe.sumelectthermalfe: -929.114854 hartree
dipole: 0.5343 -0.5197 -2.3675
dipole: 2.4820
quadrupole: -126.2373 -125.6854 -134.1755
quadrupole: 9.1611 2.0433 -1.7097
quadrupole: 2.4621 3.0140 -5.4761 9.1611 2.0433 -1.7097
hfenergy: -929.5248039 hartree
pointgroup: C01 [X(C18H32O3)]
dipole: -0.4460354 0.0267823 0.8682749 debye
polarizability: 222.8487878|-31.0971882|220.2101952|15.2342171|-0.1576563|171.2542622 unknown
InChI: InChI=1S/C18H32O3/c1-2-3-14-20-15-16-21-18(19)13-9-5-8-12-17-10-6-4-7-11-17/h6,10,17H,2-5,7-9,11-16H2,1H3
charge 0 multiplicity 1
53 atoms
O  3.445777 0.317292 0.93134
O  3.435219 -3.386339 0.681481
O  2.333841 0.516162 -1.11145
C  -4.142406 2.450156 -0.674762
C  -4.570709 3.751445 0.053646
C  -2.638954 2.454259 -1.071337
C  -6.10864 3.856848 0.176079
C  -1.665811 2.52479 0.127356
C  -5.015718 2.208061 -1.899797
C  -6.77479 3.900935 -1.219486
C  -0.185793 2.413796 -0.302355
C  -6.177615 2.864997 -2.156761
C  0.783971 2.487293 0.897897
C  2.290583 2.38484 0.516421
C  2.665262 1.011716 -0.00971
C  3.892374 -1.04886 0.542476
C  3.277453 -5.805611 0.708416
C  2.521836 -4.500848 0.975791
C  2.814033 -2.0789 0.898001
C  2.415538 -7.057995 0.989463
C  3.182278 -8.371534 0.723682
H  -4.289934 1.596076 0.027169
H  -4.107431 3.798379 1.057493
H  -4.189767 4.622274 -0.520283
H  -2.449429 3.306978 -1.755908
H  -2.419478 1.533763 -1.651874
H  -6.487732 2.975987 0.732192
H  -6.388895 4.753911 0.761249
H  -1.816394 3.473935 0.68043
H  -1.905422 1.705835 0.839144
H  -4.652831 1.45446 -2.615602
H  -7.867519 3.737311 -1.12885
H  -6.657962 4.912395 -1.665305
H  0.052892 3.232656 -1.012782
H  -0.024457 1.470297 -0.857408
H  -6.728598 2.646274 -3.082863
H  0.641088 3.452878 1.423003
H  0.536393 1.69339 1.631228
H  2.919493 2.611848 1.393029
H  2.509033 3.123699 -0.277468
H  4.805511 -1.227096 1.130021
H  4.112195 -1.075587 -0.538136
H  3.617724 -5.80926 -0.345201
H  4.1877 -5.82461 1.338611
H  2.191709 -4.445074 2.038401
H  1.616806 -4.428526 0.330756
H  1.92318 -1.950008 0.247177
H  2.504273 -1.96023 1.959837
H  1.503213 -7.028978 0.359131
H  2.06843 -7.040401 2.042968
H  4.082506 -8.440169 1.362848
H  2.551794 -9.255897 0.929454
H  3.51428 -8.429315 -0.329952
