program: Gaussian 09
title: 000229136
version: EM64L-G09RevD.01
frameworkgroup: C1[X(C14H23BrO2)]
method: RPBEPBE
basis: SDD
operation: Freq
keyword: #p
keyword: freq=noraman
keyword: PBEPBE/SDD
title: #p freq=noraman PBEPBE/SDD
converged: YES YES NO NO
title: Mulliken charges:
elementType: Br O O C C C C C C C C C C C C C C H H H H H H H H H H H H H H H H H H H H H H H
charge: -0.018320 -0.262258 -0.237398 -0.027269 -0.442756 -0.451184 -0.433401 -0.390930 -0.235933 -0.436489 -0.372081 -0.208291 -0.378457 -0.515586 0.259828 -0.243198 -0.635944 0.197235 0.193376 0.210082 0.215368 0.193719 0.189142 0.216170 0.203421 0.203375 0.201703 0.209476 0.209386 0.190416 0.193689 0.198639 0.208544 0.226134 0.252498 0.246963 0.232635 0.272104 0.292880 0.272710
chargesum: 0.00000
title: Mulliken charges with hydrogens summed into heavy atoms:
elementType: Br O O C C C C C C C C C C C C C C
charge: -0.018320 -0.262258 -0.237398 0.169966 -0.039298 -0.042097 -0.026605 0.014382 -0.034230 -0.017627 0.012025 -0.009652 0.056220 -0.016125 0.259828 0.261541 -0.070353
polarizability: 2.15002544e+02 -1.54009992e+01 1.48592871e+02 -7.42863864e+00 3.10623833e+00 1.42313362e+02
1716.lowfreq: -22.0741 -7.8785 -0.0007 -0.0006 0.0006 2.3988 7.2818 14.9064 17.1430
frequency: -16.1721 14.7282 15.6330 24.9002 39.2362 52.0552 64.3590 86.5880 109.8452 124.2440 147.2775 162.5480 165.6188 195.8385 246.0902 256.1417 292.2101 322.0233 357.8276 362.6439 410.2871 446.9779 482.1602 496.9073 535.1798 536.6163 549.6205 670.4165 679.8779 720.2799 722.9509 742.4643 785.8603 788.7905 823.1593 862.5531 874.0454 879.2503 928.0920 934.1023 939.0523 954.3022 974.2361 975.5180 1009.0703 1020.8127 1038.0013 1053.5599 1070.6561 1076.4620 1081.0488 1087.1854 1097.2289 1103.1877 1109.7870 1125.6244 1147.0436 1174.2061 1198.3489 1208.0764 1215.5072 1225.6370 1228.8836 1247.1339 1263.0601 1272.8908 1274.1653 1289.9123 1293.3845 1297.2143 1311.1513 1326.8028 1334.8790 1336.7813 1341.8328 1351.4875 1359.3919 1366.8209 1385.7073 1428.3820 1438.9642 1455.8474 1458.2608 1462.2622 1463.2678 1467.7878 1470.9824 1473.2787 1484.5415 1655.8375 1669.1220 2910.7539 2950.0076 2951.3161 2951.9752 2962.2046 2966.5205 2976.4480 2978.9789 2989.5692 2990.6179 2993.6326 3003.4107 3004.9235 3031.2239 3033.7938 3040.3458 3041.5691 3058.3527 3063.1988 3074.4401 3079.1380 3111.7747 3144.8708
redmass: 3.5738 12.5815 5.6165 5.1424 3.8106 1.8840 3.7196 3.3562 3.0580 1.9565 2.3982 5.0040 3.9825 3.7019 2.8202 1.7588 3.0610 2.5087 3.7867 3.6901 3.1532 2.2927 3.2886 3.7817 3.4064 2.7194 2.9252 2.4608 2.7173 1.4529 1.1611 1.2655 2.4167 2.2432 1.4316 2.2818 1.9264 2.2572 2.6677 2.6136 1.5043 2.2937 1.6463 1.2487 3.2017 1.5889 2.9176 2.5024 2.3292 2.2482 1.8835 2.3663 2.2967 2.3256 1.5771 1.6640 1.2138 1.3628 1.4068 1.1577 1.3078 1.3400 1.2195 1.2870 1.2834 1.1913 1.1919 1.0773 1.1678 1.2829 1.2804 1.4243 1.4338 1.7543 1.4723 1.4286 1.5803 1.6974 1.5402 1.1098 1.0840 1.0887 1.0784 1.0687 1.0771 1.0871 1.0921 1.0923 1.0996 9.7729 6.9426 1.0810 1.0593 1.0633 1.0593 1.0613 1.0628 1.0642 1.0647 1.0717 1.0646 1.0811 1.1009 1.0928 1.1006 1.0971 1.0996 1.1036 1.0592 1.1015 1.0838 1.0991 1.0979 1.1097
irintensity: 0.1983 0.6540 0.3393 0.4906 0.8952 0.8813 0.8966 1.1936 0.5592 0.0731 1.0495 0.6229 1.3431 2.8956 2.4853 0.2535 14.8350 0.8440 4.3265 2.5081 12.4760 0.9087 5.1080 0.5920 17.7700 0.0443 3.7573 19.3009 9.4363 7.6236 21.9694 0.7970 5.5899 1.0910 3.9555 6.9076 17.9643 6.4296 19.0938 34.0372 0.7759 7.0534 11.1927 0.1089 31.6869 4.5010 7.5187 33.5170 18.8974 40.9888 2.8571 19.5200 158.9327 1.3944 54.5698 90.4894 7.2287 0.5596 4.4522 0.7251 23.3170 13.9206 2.4429 10.7913 11.2891 19.5625 30.7384 0.9636 0.5148 10.3687 0.2798 18.1434 4.7261 1.6953 2.0352 3.2209 4.8646 19.5380 0.3245 10.5586 22.8197 8.8050 2.2469 0.9802 16.5197 7.7763 3.7240 4.5923 18.8123 162.5908 4.0078 22.9995 0.4360 44.4168 17.9479 72.9249 31.8707 25.1220 5.2407 21.7801 25.6736 29.5196 1.1864 53.3385 26.9660 57.1361 29.4042 84.0187 20.1479 69.7297 12.0861 6.5330 58.8143 5.7667
temp: 298.150 k
press: 1.00000 atm
elementType: 35 8 8 6 6 6 6 6 6 6 6 6 6 6 6 6 6 1 1 1 1 1 1 1 1 1 1 1 1 1 1 1 1 1 1 1 1 1 1 1
symmnumber: 1
zpe: 899071.7 jmol-1
zpe.correction: 0.342438 hartree
zpe.thermalcorrener: 0.361126 hartree
zpe.thermalcorrenthalpy: 0.362070 hartree
zpe.thermalcorrgfe: 0.290001 hartree
zpe.sumelectzpe: -709.833213 hartree
zpe.sumelectthermal: -709.814525 hartree
zpe.sumelectthermalent: -709.813581 hartree
zpe.sumelectthermalfe: -709.885650 hartree
dipole: 0.4079 -1.7508 -1.5735
dipole: 2.3891
quadrupole: -102.5983 -112.8497 -117.3368
quadrupole: -14.4109 -6.8582 3.4858
quadrupole: 8.3299 -1.9214 -6.4085 -14.4109 -6.8582 3.4858
hfenergy: -710.1756513 hartree
pointgroup: C01 [X(C14H23Br1O2)]
dipole: 0.2219867 0.0706442 -0.9106101 debye
polarizability: 217.2236578|0.0526882|141.5049711|-11.9816305|1.4459764|147.1801481 unknown
InChI: InChI=1S/C14H23BrO2/c15-11-12-17-14(16)10-6-2-5-9-13-7-3-1-4-8-13/h3,7,13H,1-2,4-6,8-12H2
charge 0 multiplicity 1
40 atoms
Br 6.745015 1.276437 1.904773
O  4.880761 0.083662 -0.630772
O  3.705474 -1.638728 0.426955
C  -3.996089 0.003515 -0.470337
C  -2.624176 0.736401 -0.468174
C  -4.253874 -0.781463 0.843021
C  -5.721269 -1.25872 0.940604
C  -1.405036 -0.206174 -0.35295
C  -5.127102 0.988992 -0.737338
C  -6.695993 -0.057086 0.956613
C  -0.054763 0.533919 -0.48128
C  -6.322866 0.978453 -0.090567
C  1.158836 -0.406896 -0.316056
C  2.500698 0.337409 -0.464083
C  3.703855 -0.536733 -0.161523
C  6.166805 -0.579207 -0.313136
C  7.174777 0.484231 0.089738
H  -3.969681 -0.728479 -1.311166
H  -2.533848 1.325708 -1.405311
H  -2.608983 1.469276 0.364992
H  -3.568957 -1.647514 0.912851
H  -4.027497 -0.11858 1.704421
H  -1.47154 -0.987784 -1.139198
H  -1.43084 -0.737985 0.618849
H  -5.951039 -1.900977 0.066774
H  -5.866582 -1.879721 1.845287
H  -4.934541 1.757393 -1.501909
H  -7.735286 -0.403398 0.785824
H  -6.698463 0.417574 1.961445
H  -0.005961 1.040195 -1.468342
H  -0.004363 1.337455 0.283438
H  -7.07189 1.747817 -0.327637
H  1.104073 -1.22211 -1.06409
H  1.123432 -0.896888 0.675241
H  2.541411 1.198213 0.235026
H  2.620981 0.767709 -1.47558
H  6.517485 -1.078489 -1.238406
H  6.008259 -1.341079 0.469513
H  7.17625 1.337606 -0.604259
H  8.184825 0.056845 0.189147
