program: Gaussian 09
title: 000021642
version: EM64L-G09RevD.01
frameworkgroup: C1[X(C6H11BrO)]
method: RPBEPBE
basis: SDD
operation: Freq
keyword: #p
keyword: freq=noraman
keyword: PBEPBE/SDD
title: #p freq=noraman PBEPBE/SDD
converged: YES YES NO NO
title: Mulliken charges:
elementType: Br O C C C C C C H H H H H H H H H H H
charge: 0.018888 -0.163312 0.180527 -0.686817 -0.692547 -0.713875 0.263939 -0.806115 0.225152 0.206070 0.240884 0.220751 0.245289 0.204082 0.216066 0.224564 0.225811 0.290073 0.300571
chargesum: 0.00000
title: Mulliken charges with hydrogens summed into heavy atoms:
elementType: Br O C C C C C C
charge: 0.018888 -0.163312 0.180527 -0.014711 -0.022425 -0.047434 0.263939 -0.215471
polarizability: 1.07219204e+02 5.39099354e+00 7.40504058e+01 1.89349488e+00 7.04431168e-01 6.14677453e+01
1716.lowfreq: -8.9003 -3.1610 0.0004 0.0005 0.0006 8.4335 26.1128 67.8274 143.2483
frequency: 25.5548 67.7245 143.2364 177.9193 199.9773 216.3242 249.7755 271.9493 300.8397 344.3470 361.5937 428.9586 537.0932 556.4149 653.8371 735.5048 828.1292 868.4350 927.6732 937.4678 949.9431 991.9155 1010.0716 1047.3169 1123.9038 1198.5939 1222.3682 1229.6426 1259.8168 1375.1002 1379.5450 1402.3030 1405.5704 1455.3050 1464.4709 1465.7019 1477.0149 1485.1983 1494.8210 1634.6425 2976.0093 2978.6764 2989.3900 3034.9245 3070.7138 3074.2183 3078.1430 3083.7164 3086.5847 3105.3836 3111.4187
redmass: 5.2392 2.7359 4.7719 1.1533 3.6620 1.6239 1.2346 1.1907 2.7375 3.0378 2.2524 2.8072 2.9609 2.6087 5.1090 5.8453 2.7225 2.0085 1.7308 1.5664 1.2087 2.0371 1.3911 1.7974 1.1461 2.5899 1.9328 2.2538 2.2934 1.1770 1.1907 1.1425 1.1456 1.0490 1.0478 1.0488 1.0522 1.0494 1.0625 10.3550 1.0346 1.0353 1.0363 1.0577 1.1001 1.0998 1.0993 1.0998 1.1003 1.0990 1.1054
irintensity: 0.8908 4.4247 0.2773 0.0402 0.1249 0.1334 0.1093 0.0391 1.8669 4.9286 0.2910 0.8186 5.0498 5.7906 38.7849 0.5450 8.6983 6.6376 3.4876 3.7257 0.3433 36.0201 0.7700 36.8010 2.1843 5.7445 3.5832 17.3680 7.9981 17.7268 27.6009 24.8425 8.6011 1.5811 1.7035 0.7281 15.6349 15.1736 31.6211 87.7792 26.7024 23.2113 23.5001 16.7240 11.5820 16.1186 48.4377 41.6900 27.8470 22.4130 2.7833
temp: 298.150 k
press: 1.00000 atm
elementType: 35 8 6 6 6 6 6 6 1 1 1 1 1 1 1 1 1 1 1
symmnumber: 1
zpe: 409692.1 jmol-1
zpe.correction: 0.156044 hartree
zpe.thermalcorrener: 0.166411 hartree
zpe.thermalcorrenthalpy: 0.167355 hartree
zpe.thermalcorrgfe: 0.118817 hartree
zpe.sumelectzpe: -323.259346 hartree
zpe.sumelectthermal: -323.248978 hartree
zpe.sumelectthermalent: -323.248034 hartree
zpe.sumelectthermalfe: -323.296572 hartree
dipole: -3.2264 -3.2910 -0.0361
dipole: 4.6088
quadrupole: -57.9145 -62.7270 -57.5448
quadrupole: 0.7741 -0.3379 0.7725
quadrupole: 1.4810 -3.3316 1.8506 0.7741 -0.3379 0.7725
hfenergy: -323.4153892 hartree
pointgroup: C01 [X(C6H11Br1O1)]
dipole: -1.3401339 1.1406623 0.4368194 debye
dipolederiv: -0.4769328 -0.0217505 0.0319887 0.035197 -0.0729438 0.0019078 0.0837757 0.013234 -0.1069402 -0.5297783 0.1011463 0.0142107 0.0195898 -0.7635033 -0.104156 0.0066825 -0.131591 -0.2645766 -0.1349019 0.1076254 -0.0325513 0.0061839 -0.0277305 0.00985 -0.1277767 0.0424019 0.1084551 -0.0409648 0.0366731 -0.0120014 -0.0012821 0.0483671 0.0298083 0.0904436 -0.0080018 -0.0041 -0.0370401 -0.0619843 0.0087026 0.018851 -0.0372113 -0.0202891 0.0140759 -0.0249893 0.0195512 0.0021613 0.0177605 0.014762 -0.0148277 0.0148282 -0.0523937 -0.0282051 -0.0484571 -0.0041844 0.8470508 -0.1171142 0.081371 0.2704319 0.8425011 0.1536941 0.1818352 0.2063814 0.0457358 0.4903518 -0.1773712 -0.1667291 -0.3329689 -0.1719713 -0.0718488 -0.270089 -0.1078969 0.0742961 -0.152487 0.0739784 -0.0204452 0.0650878 0.0740029 0.0196292 -0.0080034 0.0162576 0.0753075 0.0231656 -0.1411589 0.0187402 -0.1278781 -0.1009534 0.0525629 0.0065601 0.0027449 0.0628789 0.0995891 0.0293556 0.0334443 0.0135752 0.0152306 -0.122107 0.013764 -0.068249 -0.0672569 0.085313 0.0177179 -0.0535944 -0.0135804 0.0224437 0.0880865 -0.0169439 0.1180903 -0.0946989 0.1159948 0.0299687 0.040618 -0.0131055 0.0100647 -0.085577 0.0114208 -0.1106206 -0.0340075 -0.1756007 0.0281088 0.0003388 0.0673851 0.0527373 0.0080935 -0.0041788 0.0084139 0.0979785 0.0397715 -0.1330601 -0.0036142 -0.1403127 -0.1053202 -0.012222 0.01317 0.022391 0.0628445 -0.1714819 0.0766665 0.0371017 0.0375284 0.0858059 -0.0152221 -0.0111435 -0.0080841 0.0849031 0.0905295 0.026824 -0.0655342 0.0316809 0.0303792 0.1010415 -0.0356726 0.0554938 -0.1124261 -0.0544775 0.1003609 -0.0103842 0.0669266 -0.011801 0.0361176 0.0286177 0.054656 0.0855626 -0.0202623 0.006253 0.083576 0.0115178 0.0950742 -0.0169758 0.0516675 -0.0321748 -0.0293227 unknown
polarizability: 107.3087022|-1.8557503|72.1818348|-5.5926406|3.8088744|63.2468185 unknown
InChI: InChI=1S/C6H11BrO/c1-6(2,3)5(8)4-7/h4H2,1-3H3
charge 0 multiplicity 1
19 atoms
Br 3.310413 0.363213 -0.26796
O  0.77249 -1.464613 -0.443068
C  -1.085776 0.096554 -0.033286
C  -1.408143 0.851133 -1.363168
C  -1.95582 -1.180939 0.058124
C  -1.377853 1.022974 1.179627
C  0.414907 -0.312974 -0.105132
C  1.421256 0.793745 0.244006
H  -2.477762 1.12996 -1.371782
H  -0.816318 1.778837 -1.47251
H  -1.211889 0.20735 -2.238836
H  -1.757451 -1.732416 0.994579
H  -1.742529 -1.864573 -0.779804
H  -3.02646 -0.906597 0.034488
H  -0.834018 1.98347 1.123904
H  -2.457583 1.258317 1.204445
H  -1.121033 0.530721 2.135839
H  1.17162 1.742221 -0.257635
H  1.437048 0.960118 1.33457
