program: Gaussian 09
title: 000229133
version: EM64L-G09RevD.01
frameworkgroup: C1[X(C14H26O2)]
method: RPBEPBE
basis: SDD
operation: Freq
keyword: #pfreq=noraman
keyword: PBEPBE/SDD
title: #p freq=noraman PBEPBE/SDD
converged: YES YES NO NO
title: Mulliken charges:
elementType: O O C C C C C C C C C C C C C C H H H H H H H H H H H H H H H H H H H H H H H H H H
charge: -0.275250 -0.278634 -0.404162 -0.379478 0.003263 -0.381417 -0.385425 -0.009235 -0.384367 -0.301627 -0.373187 -0.381449 -0.711100 -0.456971 -0.034888 -0.598463 0.219866 0.211376 0.185761 0.227374 0.199581 0.197887 0.191316 0.193574 0.196965 0.210884 0.194892 0.193646 0.214510 0.201123 0.195372 0.191150 0.194793 0.211885 0.228181 0.209262 0.237877 0.198391 0.204587 0.211785 0.213305 0.217047
chargesum: 0.00000
title: Mulliken charges with hydrogens summed into heavy atoms:
elementType: O O C C C C C C C C C C C C C C
charge: -0.275250 -0.278634 0.027080 0.033657 0.202844 0.007785 0.005114 0.201649 0.004171 0.114006 0.013336 0.025229 -0.035779 -0.053994 0.176897 -0.168111
polarizability: 2.21010007e+02 -8.73134096e+00 1.27946323e+02 -9.51718706e+00 1.05224007e+00 1.30108303e+02
1716.lowfreq: -0.0011 0.0008 0.0015 4.4017 5.5056 18.2906 20.5953 25.9101 36.1710
frequency: 18.7511 24.6545 35.2516 44.5852 48.7844 77.0999 81.1910 86.3541 112.2459 121.2100 136.3705 148.4175 154.1881 159.8107 193.2402 213.7488 261.0349 295.7554 324.5900 370.5600 420.9746 436.5413 455.2794 489.8347 511.6341 581.1128 638.6062 672.3451 722.1072 724.4554 733.6445 758.4604 800.0437 820.1617 857.9701 883.9897 916.1153 920.4487 926.9918 940.3880 949.5270 973.1395 990.6670 996.1338 1006.0878 1012.3087 1034.5830 1047.3822 1062.0447 1068.4551 1078.8076 1082.4802 1088.3574 1096.6323 1118.4937 1143.3411 1161.9428 1175.5989 1182.9729 1204.7098 1209.4777 1238.1807 1240.5987 1259.8530 1268.3797 1276.0087 1280.8157 1286.0064 1291.4175 1296.2975 1299.3745 1301.3002 1309.1052 1314.1650 1330.8499 1348.1222 1353.8791 1357.2091 1360.9242 1382.6805 1393.8785 1424.8264 1448.6795 1458.0637 1460.8156 1460.9079 1462.7595 1465.7999 1473.7867 1476.4527 1481.9963 1482.3115 1487.6709 1657.5977 2934.9410 2950.2837 2951.0255 2952.4941 2953.5425 2953.8875 2959.9212 2966.2191 2968.2798 2984.4197 2985.0968 2990.3237 2992.6491 2993.2625 3004.2888 3014.4316 3026.4659 3037.0909 3045.3276 3063.6624 3067.1362 3070.0988 3088.8825 3090.0138 3102.1483 3192.2313
redmass: 3.9940 3.8939 3.3745 2.3375 3.7379 2.1492 2.7716 2.5514 2.5915 1.9466 3.0239 2.2091 2.0076 4.3215 2.2908 1.2302 2.7526 3.0207 3.2599 2.8445 2.3646 2.7660 2.5082 2.8503 2.7933 3.8236 1.5401 7.0282 1.0655 1.3641 1.3065 1.3728 1.3984 3.4446 1.3771 2.0860 1.8106 2.5648 1.5343 1.3584 1.8036 3.1891 4.4707 1.4083 1.2195 2.7645 3.3616 1.7170 2.4430 2.2046 2.3795 2.1266 2.8258 2.3738 1.5888 1.8741 2.0763 1.8857 1.4438 1.3728 1.4116 1.2772 1.3334 1.2025 1.2147 1.2500 1.1019 1.0867 1.1965 1.1017 1.1559 1.2347 1.2237 1.2716 1.3630 1.4378 1.5057 1.6359 1.6189 1.5656 1.3246 1.1788 1.0895 1.0914 1.0676 1.0558 1.0729 1.0785 1.0968 1.0575 1.0786 1.0973 1.1005 4.7442 1.0852 1.0588 1.0587 1.0616 1.0648 1.0792 1.0601 1.0627 1.0606 1.0957 1.0616 1.0679 1.0879 1.0385 1.0981 1.0990 1.1010 1.1024 1.1035 1.1030 1.1042 1.0791 1.0743 1.0990 1.1005 1.1145
irintensity: 0.1933 1.2179 2.6263 1.9891 1.2954 0.3733 1.8625 0.3801 0.5327 0.4913 0.0482 0.3268 0.0511 0.2954 1.3977 0.1302 2.0786 0.3144 0.8050 3.3289 3.0712 3.1845 1.1517 3.6839 5.2927 7.4043 17.4683 3.3376 12.8318 4.5883 5.5852 11.9590 11.3912 17.8705 6.4912 2.7785 5.6111 13.7079 21.2106 69.6996 15.7827 41.3600 4.6947 31.0789 25.9729 22.2393 1.4296 5.6504 3.4137 40.9536 5.9884 0.4246 33.8418 34.9896 12.9013 7.1596 29.2519 9.9642 1.4397 6.4412 5.9479 0.4360 0.8618 7.3657 0.7605 5.1119 0.1489 0.9199 0.4633 1.1412 1.2196 0.6983 9.6537 6.7778 2.9322 5.9270 7.8464 0.6980 1.4032 36.8770 12.8107 3.5221 5.5340 3.1779 1.4209 6.9185 0.7340 0.3474 2.9010 8.8275 6.8817 0.7492 29.6061 22.5079 61.5490 0.4840 2.7876 17.4927 8.2746 44.3398 19.6040 8.5891 188.0974 0.6098 62.4064 14.0465 14.2958 37.9063 0.1730 6.9070 3.8626 7.5498 159.5519 81.4257 38.2741 49.6794 7.7556 30.4839 31.0763 33.8267
temp: 298.150 k
press: 1.00000 atm
elementType: 8 8 6 6 6 6 6 6 6 6 6 6 6 6 6 6 1 1 1 1 1 1 1 1 1 1 1 1 1 1 1 1 1 1 1 1 1 1 1 1 1 1
symmnumber: 1
zpe: 978371.4 jmol-1
zpe.correction: 0.372642 hartree
zpe.thermalcorrener: 0.392299 hartree
zpe.thermalcorrenthalpy: 0.393243 hartree
zpe.thermalcorrgfe: 0.320895 hartree
zpe.sumelectzpe: -698.181516 hartree
zpe.sumelectthermal: -698.161859 hartree
zpe.sumelectthermalent: -698.160915 hartree
zpe.sumelectthermalfe: -698.233263 hartree
dipole: -2.0086 0.3555 0.0658
dipole: 2.0409
quadrupole: -90.0312 -105.9247 -96.8158
quadrupole: -5.0155 -0.6192 0.8157
quadrupole: 7.5594 -8.3341 0.7748 -5.0155 -0.6192 0.8157
hfenergy: -698.5541578 hartree
pointgroup: C01 [X(C14H26O2)]
dipole: -0.789589 -0.141036 -0.0370146 debye
polarizability: 220.6832528|8.8814434|127.9795755|10.8286061|1.2079029|130.401805 unknown
InChI: InChI=1S/C14H26O2/c1-3-4-5-6-7-8-9-10-11-14-15-12-13(2)16-14/h3,13-14H,1,4-12H2,2H3
charge 0 multiplicity 1
42 atoms
O  -4.988611 0.917876 0.13617
O  -4.066585 -1.251452 -0.083475
C  -2.552373 0.725114 0.020511
C  -1.300966 -0.073387 0.446885
C  -3.843804 0.096975 0.527726
C  0.008179 0.544687 -0.090832
C  1.269133 -0.241167 0.333185
C  -6.128162 -0.030982 0.001844
C  2.581027 0.369407 -0.208822
C  -5.439846 -1.259406 -0.638049
C  3.842019 -0.41712 0.214462
C  5.152552 0.195474 -0.327919
C  -7.219025 0.632425 -0.831362
C  6.415131 -0.59714 0.106644
C  7.692889 -0.029511 -0.474291
C  8.753788 0.420881 0.242376
H  -2.613894 0.791207 -1.081902
H  -2.497501 1.75955 0.414177
H  -1.252872 -0.125882 1.554989
H  -1.399827 -1.115314 0.085115
H  -3.835001 -0.054903 1.63058
H  -0.038297 0.592217 -1.198863
H  0.094785 1.594126 0.261898
H  1.316886 -0.287103 1.441455
H  1.180387 -1.290744 -0.017221
H  -6.498818 -0.290306 1.01735
H  2.66958 1.419115 0.141641
H  2.532836 0.415503 -1.317043
H  -5.915528 -2.216935 -0.364024
H  -5.397874 -1.158409 -1.74049
H  3.890249 -0.463708 1.322589
H  3.754594 -1.466932 -0.136643
H  5.109171 0.235581 -1.436303
H  5.247279 1.243934 0.018963
H  -6.821553 0.925631 -1.81864
H  -8.068382 -0.058963 -0.981148
H  -7.595305 1.537568 -0.325354
H  6.295224 -1.650935 -0.225127
H  6.480582 -0.616241 1.212154
H  7.73484 0.019675 -1.574879
H  9.647975 0.827196 -0.244096
H  8.75632 0.395401 1.339572
