program: Gaussian 09
title: 000229122
version: EM64L-G09RevD.01
frameworkgroup: C1[X(C16H32O2)]
method: RPBEPBE
basis: SDD
operation: Freq
keyword: #pfreq=noraman
keyword: PBEPBE/SDD
title: #p freq=noraman PBEPBE/SDD
converged: YES YES NO NO
title: Mulliken charges:
elementType: O O C C C C C C C C C C C C C C C C H H H H H H H H H H H H H H H H H H H H H H H H H H H H H H H H
charge: -0.248625 -0.248933 0.278558 -0.368307 -0.368797 0.052141 -0.447254 -0.423702 -0.367073 -0.695621 -0.733852 -0.388446 -0.383574 -0.382774 -0.372757 -0.353570 -0.356700 -0.696865 0.183159 0.228486 0.228437 0.183505 0.192630 0.226260 0.227350 0.202003 0.200175 0.192236 0.193631 0.202511 0.202431 0.258280 0.210697 0.219353 0.219358 0.192412 0.194151 0.194130 0.193160 0.191522 0.192516 0.189742 0.189362 0.187699 0.187348 0.194766 0.194898 0.209568 0.209543 0.214831
chargesum: 0.00000
title: Mulliken charges with hydrogens summed into heavy atoms:
elementType: O O C C C C C C C C C C C C C C C C
charge: -0.248625 -0.248933 0.278558 0.043338 0.043146 0.244770 0.006355 -0.021524 0.018794 -0.032398 -0.084444 -0.001883 0.003716 0.001264 0.006346 0.021477 0.032964 -0.062924
polarizability: 2.39939210e+02 -2.32939352e+00 1.54699745e+02 2.29154154e-01 7.79584826e-03 1.50136660e+02
1716.lowfreq: -36.9262 -10.3431 -2.8408 -0.0018 0.0011 0.0018 9.9541 21.5358 23.5186
frequency: -36.4102 19.1366 22.8171 46.7973 54.9263 61.0590 85.0038 103.1857 109.7493 124.7232 131.0913 148.4865 156.0172 164.9452 178.8356 204.1336 212.4089 229.1930 229.9692 261.5143 291.1428 303.9484 320.9876 343.3083 390.0932 403.7326 409.5505 446.7574 481.0302 488.4857 504.8915 567.2005 637.6382 719.8760 721.5319 725.4178 740.4070 771.2950 772.2246 811.4320 855.2634 886.0721 890.7474 895.2947 911.6335 919.3404 938.4540 940.2165 953.3869 972.3877 978.8060 991.8464 1004.3869 1018.4143 1023.3099 1027.8850 1046.9587 1059.4720 1066.1324 1080.1411 1080.3574 1083.8136 1111.9460 1127.7864 1130.9145 1178.0696 1183.9943 1199.9732 1200.4310 1210.2276 1214.0488 1239.9935 1243.8510 1267.4107 1268.2361 1273.0908 1279.8329 1288.9914 1289.3594 1294.3525 1298.3954 1300.1952 1305.1411 1314.3330 1323.6524 1342.8161 1346.2592 1353.3032 1355.3201 1357.2135 1359.5746 1375.2838 1382.1948 1389.0656 1397.3186 1447.5217 1452.8979 1454.6867 1461.0179 1461.4477 1464.7848 1465.4991 1465.5964 1470.3050 1470.7000 1476.1442 1476.9440 1478.8957 1481.9586 1486.8929 1487.0427 1489.7614 2864.4046 2919.1276 2929.0795 2949.9077 2950.2712 2951.9431 2953.6017 2957.0381 2961.8307 2966.8228 2967.0212 2969.1234 2971.7464 2978.2585 2983.1856 2986.9782 2993.1169 3001.4060 3005.8216 3011.9969 3023.5951 3034.3205 3042.9603 3059.8731 3063.2067 3065.7523 3068.4287 3070.3001 3071.8824 3072.2543 3072.8788 3098.7264
redmass: 3.1330 3.5048 3.7176 1.8575 3.8157 2.4846 1.8387 3.5217 2.0232 2.0322 4.2517 1.9319 2.0585 1.0315 3.5277 1.4299 2.1762 1.1340 3.4515 2.1025 3.2076 3.4684 2.3505 2.7419 2.7420 2.0354 2.1032 3.2673 3.0140 5.6504 3.3623 5.1496 3.9628 1.2233 1.0687 1.0861 1.1686 1.3819 3.1446 1.5209 1.4214 2.3134 3.3200 1.9508 1.3101 2.2901 1.4855 1.4224 4.2213 1.2653 3.7777 3.9536 3.3394 1.4266 1.1387 3.4301 2.7280 3.3677 2.9885 2.2904 2.1632 2.3232 2.2719 2.9578 1.4789 2.0069 1.7986 1.6825 1.4104 1.3772 1.4871 1.3194 1.3536 1.5670 1.3231 1.5420 1.0220 1.1532 1.0575 1.3904 1.1110 1.1094 1.6210 1.1525 1.3780 1.4461 1.2001 1.6469 1.5920 1.3670 1.6076 1.2351 1.6473 1.2174 1.2162 1.0808 1.0721 1.0726 1.0734 1.0719 1.0625 1.0771 1.0482 1.0816 1.0754 1.0807 1.0444 1.0571 1.0865 1.0602 1.0917 1.0963 1.0831 1.0675 1.0677 1.0585 1.0586 1.0591 1.0592 1.0593 1.0591 1.0511 1.0432 1.0584 1.0367 1.0369 1.0961 1.0974 1.0994 1.1015 1.0596 1.1036 1.1046 1.1048 1.1046 1.0988 1.0986 1.0979 1.1007 1.0993 1.0996 1.0995 1.0965 1.0983
irintensity: 0.0336 0.0601 0.2083 0.2369 0.3451 0.0205 0.0625 0.1964 0.0147 0.0619 0.0207 0.0146 0.0030 0.1289 0.8371 0.6338 1.7408 0.0534 2.5700 1.0469 2.1988 4.7897 4.3310 0.4109 0.6143 1.1051 3.3611 0.1424 1.3068 3.2465 0.3016 1.5175 6.9542 3.3873 13.6370 0.1814 11.2198 6.7237 2.9692 29.7460 9.0364 7.8075 19.5958 18.9841 13.2396 5.1340 19.4467 6.8116 3.1954 3.4046 12.1351 24.0351 6.1055 1.5300 1.9309 4.1946 93.3704 30.2345 6.4417 2.1472 1.0145 2.2553 72.3729 2.7365 10.3480 3.1823 0.3013 2.3877 3.6371 12.8987 1.9752 0.2274 0.9850 0.0941 0.5237 3.3143 0.0103 0.1803 0.7902 2.5335 0.2887 0.3167 7.9613 3.1133 0.9166 1.0396 2.7145 1.4226 2.0500 4.1647 0.1543 21.2697 35.8871 11.3807 17.3369 6.0628 2.3642 5.1641 0.0751 0.1585 0.0430 0.4435 0.6600 0.3525 18.7996 1.7812 12.0370 10.6179 2.9572 23.6232 1.1369 35.7820 69.1875 25.0123 114.4958 0.0033 0.1024 0.1957 0.6789 0.6300 11.3842 11.2682 74.6683 244.8060 37.0519 31.6828 0.0606 0.0289 0.0491 0.1477 21.4376 0.1251 6.0300 0.1500 233.2164 24.3201 0.1615 0.6050 96.7562 56.1491 7.5542 122.4915 53.1996 18.9042
temp: 298.150 k
press: 1.00000 atm
elementType: 8 8 6 6 6 6 6 6 6 6 6 6 6 6 6 6 6 6 1 1 1 1 1 1 1 1 1 1 1 1 1 1 1 1 1 1 1 1 1 1 1 1 1 1 1 1 1 1 1 1
symmnumber: 1
zpe: 1185683.5 jmol-1
zpe.correction: 0.451603 hartree
zpe.thermalcorrener: 0.473256 hartree
zpe.thermalcorrenthalpy: 0.474200 hartree
zpe.thermalcorrgfe: 0.399249 hartree
zpe.sumelectzpe: -777.830793 hartree
zpe.sumelectthermal: -777.809140 hartree
zpe.sumelectthermalent: -777.808196 hartree
zpe.sumelectthermalfe: -777.883147 hartree
dipole: 1.1938 -1.7377 0.1170
dipole: 2.1115
quadrupole: -101.2007 -115.5671 -116.7287
quadrupole: -8.7475 0.7169 -0.2157
quadrupole: 9.9648 -4.4016 -5.5632 -8.7475 0.7169 -0.2157
hfenergy: -778.2823962 hartree
pointgroup: C01 [X(C16H32O2)]
dipole: 0.4723734 -0.3769762 -0.5699777 debye
polarizability: 239.933976|-2.2854474|151.2427319|-0.9062878|1.9260484|153.5989071 unknown
InChI: InChI=1S/C16H32O2/c1-4-5-6-7-8-9-10-11-12-15-17-13-16(2,3)14-18-15/h15H,4-14H2,1-3H3
charge 0 multiplicity 1
50 atoms
O  3.862703 1.070047 -0.355027
O  3.780523 -0.981914 0.921883
C  5.97941 -0.236451 -0.025137
C  5.14896 0.679193 -0.966828
C  5.064156 -1.434482 0.349401
C  3.069357 -0.120732 -0.03013
C  1.750747 0.323686 0.605132
C  0.502443 -0.117076 -0.192284
C  -0.816979 0.303822 0.491448
C  6.397922 0.538316 1.246561
C  7.220489 -0.758862 -0.784808
C  -2.077608 -0.12022 -0.295019
C  -3.396093 0.262412 0.414532
C  -4.660062 -0.150036 -0.373188
C  -5.976732 0.206216 0.353576
C  -7.242851 -0.196571 -0.435802
C  -8.558403 0.148682 0.299248
C  -9.818535 -0.252629 -0.498003
H  4.9532 0.151099 -1.928839
H  5.673975 1.626552 -1.174963
H  5.524836 -2.066175 1.127244
H  4.866321 -2.05493 -0.555144
H  2.929193 -0.703815 -0.975813
H  1.711808 -0.093913 1.628145
H  1.772729 1.425038 0.697787
H  0.541278 0.316431 -1.212879
H  0.511887 -1.21991 -0.314828
H  -0.855193 -0.136724 1.509831
H  -0.823372 1.405331 0.629567
H  7.033525 1.405762 0.986864
H  6.973624 -0.11297 1.930873
H  5.509003 0.907869 1.784474
H  6.938798 -1.309558 -1.703148
H  7.812944 -1.441572 -0.147104
H  7.881161 0.077948 -1.079855
H  -2.055941 -1.218398 -0.457416
H  -2.05469 0.343437 -1.30349
H  -3.414204 1.358838 0.588251
H  -3.420129 -0.210822 1.418584
H  -4.632289 -1.243528 -0.563887
H  -4.647086 0.339016 -1.369778
H  -6.001442 1.298346 0.552355
H  -5.991392 -0.289925 1.346728
H  -7.234793 0.306552 -1.425493
H  -7.215984 -1.287273 -0.642269
H  -8.582929 1.237798 0.508566
H  -8.566738 -0.357174 1.28637
H  -9.84757 0.26174 -1.477236
H  -9.834007 -1.341904 -0.692118
H  -10.74467 0.006532 0.04757
