program: Gaussian 09
title: 000229143
version: EM64L-G09RevD.01
frameworkgroup: C1[X(C19H30O2)]
method: RPBEPBE
basis: SDD
operation: Freq
keyword: #pfreq=noraman
keyword: PBEPBE/SDD
title: #p freq=noraman PBEPBE/SDD
converged: YES YES NO NO
title: Mulliken charges:
elementType: O O C C C C C C C C C C C C C C C C C C C H H H H H H H H H H H H H H H H H H H H H H H H H H H H H H
charge: -0.290356 -0.225822 -0.388757 -0.379973 -0.363818 -0.373228 -0.389905 -0.352892 -0.571892 -0.356720 0.514476 -0.696406 -0.417695 -0.385045 -0.325380 -0.412647 0.348029 -0.183291 0.224739 -0.688233 -0.684462 0.194417 0.196066 0.192489 0.191585 0.193986 0.191625 0.190312 0.189564 0.208941 0.212077 0.187943 0.187334 0.205955 0.208601 0.195071 0.194744 0.209727 0.215164 0.209560 0.234630 0.236225 0.299538 0.252396 0.243797 0.236848 0.214013 0.223339 0.228658 0.222637 0.232036
chargesum: 0.00000
title: Mulliken charges with hydrogens summed into heavy atoms:
elementType: O O C C C C C C C C C C C C C C C C C C C
charge: -0.290356 -0.225822 0.001726 0.004102 0.021794 0.006648 0.031113 0.022385 -0.157336 0.033096 0.514476 -0.061955 -0.183065 -0.148821 -0.025843 -0.160251 0.348029 0.060506 0.224739 -0.014032 -0.001132
polarizability: 3.16026364e+02 -2.41219998e+01 1.61786340e+02 4.11727732e+00 1.40667291e+00 1.85736987e+02
1716.lowfreq: -9.9747 -7.6690 -0.0014 0.0016 0.0019 3.0438 5.0775 11.1306 16.9197
frequency: -7.6039 10.6800 16.5554 27.3148 30.3625 39.3203 46.7343 69.1768 76.8834 87.2759 111.4205 116.8691 138.2294 139.6028 142.2499 148.4877 195.3435 212.2954 226.8401 230.2191 234.7773 261.2928 276.6616 299.7610 312.5050 349.0494 371.8488 391.3311 403.7964 410.8788 461.8103 471.0677 528.9342 571.9611 620.0345 654.5871 698.0797 719.4134 720.7128 725.2179 737.5987 743.0278 765.8028 807.0790 813.8132 823.9901 838.1115 854.4456 878.1624 887.1244 910.9689 927.4993 946.4765 957.7647 962.8349 979.9974 989.7981 992.6830 1008.5584 1009.8217 1035.3250 1051.3146 1068.4077 1070.1838 1076.5103 1079.9377 1081.6921 1098.8148 1113.8449 1120.1264 1125.4500 1147.3119 1177.2576 1184.3011 1194.9456 1208.6198 1213.7175 1217.8945 1246.6342 1246.8847 1272.4277 1278.5959 1280.2114 1284.3582 1291.5303 1294.2227 1294.3136 1306.2216 1311.7719 1332.9044 1335.4454 1347.3023 1353.9904 1354.5503 1376.8196 1379.9988 1388.3075 1396.5067 1411.4351 1460.4093 1460.7007 1464.1910 1464.4891 1465.7432 1470.6613 1471.2920 1476.0741 1476.9902 1477.3068 1482.3814 1487.5228 1489.6886 1489.9624 1491.2863 1584.6778 1616.7976 1643.2590 2948.3514 2949.4175 2950.4208 2954.3061 2960.7016 2966.7213 2967.8583 2970.9795 2976.9636 2982.1984 2984.9101 2987.0124 2990.2497 2995.0349 3006.8575 3016.2760 3026.7160 3031.1087 3038.0469 3047.7749 3067.4952 3069.9510 3085.6169 3087.0699 3091.2401 3099.1069 3124.1563 3127.7433 3165.2566 3207.9895
redmass: 3.1824 3.9407 3.9473 3.2306 4.5952 1.9416 3.4073 2.3097 4.7053 1.9781 2.5160 2.3673 3.2287 2.2663 4.9354 1.9883 1.0810 3.0330 1.7403 1.1403 2.0315 3.7402 2.5524 3.4929 4.4839 3.3553 3.1445 3.7302 3.0779 3.0025 3.3057 3.0875 2.9650 3.9516 5.7737 4.1256 5.5092 4.3177 1.0607 1.0742 1.1172 4.2819 1.1579 3.5804 1.2766 4.0717 1.3923 1.5840 1.2455 1.9057 2.7542 1.1653 1.2216 1.3834 1.4250 1.3850 4.2132 4.1433 1.4417 1.9023 3.5384 3.1011 2.7032 1.7918 2.2439 2.1738 2.2283 1.6023 2.4800 2.6549 1.2437 2.4112 1.7786 1.8216 1.3685 1.2721 1.5069 2.7650 1.3353 1.3459 1.1989 1.0523 1.3345 1.0939 1.1189 1.1316 1.3060 1.2785 1.3792 1.4346 1.6383 1.5428 1.6968 1.6364 1.2431 5.0002 1.2172 1.2049 3.0318 1.0741 1.0730 1.0458 1.0650 1.0829 1.0844 1.0482 1.0647 1.0608 1.0491 1.0877 1.0936 1.3353 1.4306 1.2474 7.1183 6.5439 9.8107 1.0586 1.0586 1.0590 1.0593 1.0590 1.0590 1.0587 1.0365 1.0597 1.0962 1.0342 1.0978 1.0354 1.1002 1.1020 1.1029 1.1045 1.0850 1.1047 1.1046 1.1007 1.0993 1.1007 1.1004 1.1007 1.0996 1.0898 1.0906 1.0953 1.0941
irintensity: 0.1022 0.4428 0.1382 0.1467 1.5799 0.0049 0.0271 0.0043 0.0319 0.2067 1.0006 0.3728 0.1020 0.0220 0.1351 0.0131 0.1736 0.2770 1.7776 0.1048 0.8692 0.5896 0.1395 1.7594 10.8743 0.3880 0.6463 1.8680 1.6251 0.3374 0.3787 0.0146 16.5011 7.7191 0.6523 1.7386 3.3840 1.7016 15.0775 0.0152 4.7529 3.8526 0.3292 9.2566 0.9180 13.5573 13.0205 45.6321 0.9772 4.3781 2.7452 4.3036 0.2060 2.4387 4.3256 1.4971 0.6848 0.4797 4.5244 6.9102 0.1760 3.7081 1.1235 227.2667 369.6368 1.2351 1.3875 26.6513 14.1055 16.9403 14.6629 192.5932 0.9261 0.0528 66.2602 17.8959 0.4012 10.2627 0.5472 0.3072 0.1110 0.2956 0.3678 0.2193 0.0979 1.0923 6.7182 0.4283 0.9569 1.6874 31.9185 0.6706 0.2800 0.3425 13.8278 7.9613 11.3034 31.5281 5.5373 0.0511 0.0357 7.1427 0.0210 0.5671 0.2948 1.6085 6.1994 7.3178 16.1320 1.5376 0.0849 56.0731 134.0115 7.0172 3.0167 1.2279 174.8295 1.8515 0.0551 3.5239 0.0920 39.8622 20.4076 127.5704 39.0492 107.7031 0.5336 27.1277 0.7157 32.7003 0.5965 1.2038 0.2051 0.8755 5.3252 76.0748 155.1087 98.1221 55.2899 14.7266 31.7625 36.0413 37.5995 17.9358 17.7914 5.7654 2.7015
temp: 298.150 k
press: 1.00000 atm
elementType: 8 8 6 6 6 6 6 6 6 6 6 6 6 6 6 6 6 6 6 6 6 1 1 1 1 1 1 1 1 1 1 1 1 1 1 1 1 1 1 1 1 1 1 1 1 1 1 1 1 1 1
symmnumber: 1
zpe: 1168070.8 jmol-1
zpe.correction: 0.444895 hartree
zpe.thermalcorrener: 0.468899 hartree
zpe.thermalcorrenthalpy: 0.469843 hartree
zpe.thermalcorrgfe: 0.386479 hartree
zpe.sumelectzpe: -890.836825 hartree
zpe.sumelectthermal: -890.812821 hartree
zpe.sumelectthermalent: -890.811877 hartree
zpe.sumelectthermalfe: -890.895241 hartree
dipole: 0.7306 0.2902 1.6840
dipole: 1.8584
quadrupole: -122.2511 -130.8480 -128.3902
quadrupole: -6.3745 -10.4083 0.4632
quadrupole: 4.9120 -3.6849 -1.2271 -6.3745 -10.4083 0.4632
hfenergy: -891.2817199 hartree
pointgroup: C01 [X(C19H30O2)]
dipole: 0.271147 -0.0771353 -0.6746294 debye
polarizability: 315.3712524|25.6168511|162.1327219|-6.1352028|-0.5155369|186.0457172 unknown
InChI: InChI=1S/C19H30O2/c1-4-5-6-7-8-9-10-11-17-12-14-18(15-13-17)21-19(20)16(2)3/h12-16H,4-11H2,1-3H3
charge 0 multiplicity 1
51 atoms
O  -4.787439 -0.133367 -0.417793
O  -5.548604 -0.457553 1.78954
C  4.185825 -0.133817 -0.054194
C  5.650283 0.349517 0.046811
C  3.156683 1.006196 0.116803
C  6.685564 -0.784193 -0.129624
C  1.691337 0.529185 0.013456
C  8.148713 -0.296628 -0.03093
C  0.671405 1.690968 0.178429
C  9.18606 -1.428455 -0.211244
C  -0.774199 1.232523 0.067347
C  10.644715 -0.93121 -0.11479
C  -1.53438 0.908548 1.21806
C  -1.395098 1.082662 -1.2013
C  -2.86905 0.448831 1.135182
C  -2.72269 0.626651 -1.313626
C  -3.452785 0.311874 -0.145588
C  -7.00793 -0.989854 -0.140403
C  -5.740588 -0.499631 0.555875
C  -8.258976 -0.599706 0.676658
C  -6.904436 -2.532046 -0.323831
H  4.028907 -0.625546 -1.037037
H  4.002501 -0.91289 0.715041
H  5.807366 0.838739 1.031048
H  5.830595 1.131964 -0.72015
H  3.314032 1.497648 1.100035
H  3.342821 1.785812 -0.651951
H  6.507571 -1.566388 0.638051
H  6.528461 -1.27421 -1.113511
H  1.526844 0.03703 -0.96664
H  1.491723 -0.24128 0.785386
H  8.308025 0.191282 0.95367
H  8.326952 0.486999 -0.797213
H  0.886193 2.457634 -0.592758
H  0.841228 2.172271 1.161579
H  9.009153 -2.210177 0.555766
H  9.024456 -1.916554 -1.194229
H  10.840146 -0.465476 0.869755
H  11.365661 -1.759224 -0.245815
H  10.856632 -0.172153 -0.891562
H  -1.0798 1.021868 2.209965
H  -0.835035 1.333204 -2.11042
H  -3.439175 0.211994 2.033642
H  -3.208672 0.514473 -2.287634
H  -7.041733 -0.522045 -1.14068
H  -8.190544 -1.001651 1.702337
H  -9.166003 -1.008555 0.196546
H  -8.37007 0.496906 0.748797
H  -6.853007 -3.035774 0.658265
H  -7.797832 -2.903303 -0.856973
H  -6.010407 -2.809592 -0.909553
